Build #1

Build: #1 failed First build for this plan

Build result summary

Details

Completed
Duration
73 minutes
Labels
None
Revision
62ac2afe4288fb5dc0122c6022f1bc98b1aa7957 62ac2afe4288fb5dc0122c6022f1bc98b1aa7957
Total tests
2248

No failed tests found, a possible compilation error occurred.

  • 0 New failures
  • 0 Existing failures
  • 0 Fixed

Responsible

No one has taken responsibility for this failure

Error summary for build, test, publish

The job generated some errors, drill down into the full build log for more details.

2013-09-26 22:07:10:827  edu.illinois.ncsa.daffodil.compiler.ProcessorFactory Error[Compilation (DataProcessor) reports 1 compile errors/warnings.]
2013-09-26 22:07:10:827  edu.illinois.ncsa.daffodil.compiler.ProcessorFactory Error[Schema Definition Error: Cannot convert -129 to Byte.
Schema context: element.ivc_byte_range_min. Location line 297 column 95 in file:/tmp/daffodil_tmp_4633715931659695198.dfdl.xsd.]
2013-09-26 22:07:10:954  edu.illinois.ncsa.daffodil.compiler.ProcessorFactory Error[Compilation (DataProcessor) reports 1 compile errors/warnings.]
2013-09-26 22:07:10:955  edu.illinois.ncsa.daffodil.compiler.ProcessorFactory Error[Schema Definition Error: Cannot convert 32768 to Short.
Schema context: element.ivc_short_range_max. Location line 122 column 98 in file:/tmp/daffodil_tmp_2474361914479090065.dfdl.xsd.]
bom: xs:unsignedByte: 10
pred1 [1]: xs:boolean: true
bom: xs:unsignedByte: 20
pred1 [1]: xs:boolean: false
pred2 [1]: xs:boolean: true
bom: xs:unsignedShort: 65279
pred1 [1]: xs:boolean: true
bom: xs:unsignedShort: 65534
pred1 [1]: xs:boolean: false
pred2 [1]: xs:boolean: true
bom: xs:unsignedShort: 65534
pred1 [1]: xs:boolean: false
pred2 [1]: xs:boolean: true
2013-09-26 22:07:15:396  edu.illinois.ncsa.daffodil.compiler.ProcessorFactory Error[Compilation (DataProcessor) reports 1 compile errors/warnings.]
2013-09-26 22:07:15:396  edu.illinois.ncsa.daffodil.compiler.ProcessorFactory Error[Schema Definition Error: Expression compiler reports: net.sf.saxon.trans.XPathException: XPath syntax error at char 10 in {fn:abs(-9)}:
    Prefix fn has not been declared
Schema context: element.abs. Location line 19 column 78 in file:/home/opensource/data/bamboo/xml-data/build-dir/DFDL-REV0-JOB1/daffodil-test/target/scala-2.9.2/test-classes/edu/illinois/ncsa/daffodil/section23/dfdl_functions/Functions-neg.dfdl.xsd.]
2013-09-26 22:07:16:065  edu.illinois.ncsa.daffodil.compiler.ProcessorFactory Error[Compilation (DataProcessor) reports 1 compile errors/warnings.]
2013-09-26 22:07:16:065  edu.illinois.ncsa.daffodil.compiler.ProcessorFactory Error[Schema Definition Error: '{ {{ [' is an unterminated expression.  Add missing closing brac, or escape opening brace with another opening brace.
Schema context: sequence. Location line 50 column 46 in file:/tmp/daffodil_tmp_9142181454388463543.dfdl.xsd.]
2013-09-26 22:07:16:594  edu.illinois.ncsa.daffodil.compiler.ProcessorFactory Error[Compilation (DataProcessor) reports 1 compile errors/warnings.]
2013-09-26 22:07:16:594  edu.illinois.ncsa.daffodil.compiler.ProcessorFactory Error[Schema Definition Error: Expression compiler reports: net.sf.saxon.trans.XPathException: Value 12345678987654321 cannot be converted to integer subtype xs:short
Schema context: element.short02. Location line 115 column 765 in file:/tmp/daffodil_tmp_1156378908429029547.dfdl.xsd.]
2013-09-26 22:07:16:923  edu.illinois.ncsa.daffodil.compiler.ProcessorFactory Error[Compilation (DataProcessor) reports 1 compile errors/warnings.]
2013-09-26 22:07:16:923  edu.illinois.ncsa.daffodil.compiler.ProcessorFactory Error[Schema Definition Error: Expression compiler reports: javax.xml.xpath.XPathExpressionException: no such function: {http://www.ogf.org/dfdl/dfdl-1.0/}setBits with arity 6
Schema context: element.setBits1. Location line 53 column 421 in file:/tmp/daffodil_tmp_2782004961701313092.dfdl.xsd.]
2013-09-26 22:07:17:049  edu.illinois.ncsa.daffodil.compiler.ProcessorFactory Error[Compilation (DataProcessor) reports 1 compile errors/warnings.]
2013-09-26 22:07:17:049  edu.illinois.ncsa.daffodil.compiler.ProcessorFactory Error[Schema Definition Error: Cannot convert 2.5 to Int.
Schema context: element.e3. Location line 25 column 77 in file:/tmp/daffodil_tmp_1875690661728481012.dfdl.xsd.]
2013-09-26 22:07:17:109  edu.illinois.ncsa.daffodil.compiler.ProcessorFactory Error[Compilation (DataProcessor) reports 1 compile errors/warnings.]
2013-09-26 22:07:17:109  edu.illinois.ncsa.daffodil.compiler.ProcessorFactory Error[Schema Definition Error: Expression compiler reports: net.sf.saxon.trans.XPathException: Arithmetic operator is not defined for arguments of types (xs:decimal, xs:string)
Schema context: element.e1. Location line 38 column 98 in file:/tmp/daffodil_tmp_7588424166943615769.dfdl.xsd.]
r [1]: element(ex:r, untyped): /ex:e/ex:s[1]/ex:r[1]
r [2]: element(ex:r, untyped): /ex:e/ex:s[1]/ex:r[2]
r [1]: element(ex:r, untyped): /ex:e/ex:s[1]/ex:r[1]
r [1]: element(ex:r, untyped): /ex:e/ex:s[1]/ex:r[1]
r [2]: element(ex:r, untyped): /ex:e/ex:s[1]/ex:r[2]
r [1]: element(ex:r, untyped): /ex:e/ex:s[1]/ex:r[1]
r [2]: element(ex:r, untyped): /ex:e/ex:s[1]/ex:r[2]
r [3]: element(ex:r, untyped): /ex:e/ex:s[1]/ex:r[3]
r [1]: element(ex:r, untyped): /ex:e/ex:s[1]/ex:r[1]
r [2]: element(ex:r, untyped): /ex:e/ex:s[1]/ex:r[2]
r [3]: element(ex:r, untyped): /ex:e/ex:s[1]/ex:r[3]
r [4]: element(ex:r, untyped): /ex:e/ex:s[1]/ex:r[4]
r [5]: element(ex:r, untyped): /ex:e/ex:s[1]/ex:r[5]
r [1]: element(ex:r, untyped): /ex:e/ex:s[1]/ex:r[1]
r [1]: element(ex:r, untyped): /ex:e/ex:s[1]/ex:r[1]
r [2]: element(ex:r, untyped): /ex:e/ex:s[1]/ex:r[2]
r [1]: element(ex:r, untyped): /ex:e/ex:s[1]/ex:r[1]
r [2]: element(ex:r, untyped): /ex:e/ex:s[1]/ex:r[2]
r [3]: element(ex:r, untyped): /ex:e/ex:s[1]/ex:r[3]
r [1]: element(ex:r, untyped): /ex:e/ex:s[1]/ex:r[1]
r [2]: element(ex:r, untyped): /ex:e/ex:s[1]/ex:r[2]
r [3]: element(ex:r, untyped): /ex:e/ex:s[1]/ex:r[3]
r [4]: element(ex:r, untyped): /ex:e/ex:s[1]/ex:r[4]
r [5]: element(ex:r, untyped): /ex:e/ex:s[1]/ex:r[5]
2013-09-26 22:07:18:705  edu.illinois.ncsa.daffodil.compiler.ProcessorFactory Error[Compilation (DataProcessor) reports 1 compile errors/warnings.]
2013-09-26 22:07:18:705  edu.illinois.ncsa.daffodil.compiler.ProcessorFactory Error[Schema Definition Error: Expression compiler reports: net.sf.saxon.trans.XPathException: XPath syntax error at char 18 in {theUnknownPrefix:x}:
    Prefix theUnknownPrefix has not been declared
Schema context: element.theElementName. Location line 14 column 386 in file:/tmp/daffodil_tmp_1711248203424573049.dfdl.xsd.]
2013-09-26 22:07:19:277  edu.illinois.ncsa.daffodil.compiler.ProcessorFactory Error[Compilation (DataProcessor) reports 1 compile errors/warnings.]
2013-09-26 22:07:19:277  edu.illinois.ncsa.daffodil.compiler.ProcessorFactory Error[Schema Definition Error: Expression compiler reports: net.sf.saxon.trans.XPathException: Value -50 cannot be converted to integer subtype xs:unsignedShort
Schema context: element.ushort01. Location line 108 column 395 in file:/tmp/daffodil_tmp_8418235960306791028.dfdl.xsd.]
2013-09-26 22:07:19:346  edu.illinois.ncsa.daffodil.compiler.ProcessorFactory Error[Compilation (DataProcessor) reports 1 compile errors/warnings.]
2013-09-26 22:07:19:347  edu.illinois.ncsa.daffodil.compiler.ProcessorFactory Error[Schema Definition Error: Expression compiler reports: net.sf.saxon.trans.XPathException: Value 12345678987654321 cannot be converted to integer subtype xs:unsignedShort
Schema context: element.ushort02. Location line 108 column 799 in file:/tmp/daffodil_tmp_5414726430433178004.dfdl.xsd.]
2013-09-26 22:07:19:590  edu.illinois.ncsa.daffodil.compiler.ProcessorFactory Error[Compilation (DataProcessor) reports 1 compile errors/warnings.]
2013-09-26 22:07:19:590  edu.illinois.ncsa.daffodil.compiler.ProcessorFactory Error[Schema Definition Error: Expression compiler reports: javax.xml.xpath.XPathExpressionException: no such function: {http://www.ogf.org/dfdl/dfdl-1.0/}notAFunction with arity 3
Schema context: element.err. Location line 86 column 101 in file:/tmp/daffodil_tmp_6649293901349600397.dfdl.xsd.]
2013-09-26 22:07:19:906  edu.illinois.ncsa.daffodil.compiler.ProcessorFactory Error[Compilation (DataProcessor) reports 1 compile errors/warnings.]
2013-09-26 22:07:19:906  edu.illinois.ncsa.daffodil.compiler.ProcessorFactory Error[Schema Definition Error: Expression compiler reports: net.sf.saxon.trans.XPathException: Value -50 cannot be converted to integer subtype xs:unsignedLong
Schema context: element.ulong01. Location line 101 column 392 in file:/tmp/daffodil_tmp_4344567263021880483.dfdl.xsd.]
2013-09-26 22:07:20:317  edu.illinois.ncsa.daffodil.compiler.Compiler Error[Compilation (ProcessorFactory) produced 2 errors/warnings.]
2013-09-26 22:07:20:317  edu.illinois.ncsa.daffodil.compiler.Compiler Error[Schema Definition Error: Error loading schema due to org.xml.sax.SAXParseException; lineNumber: 22; columnNumber: 196; cvc-pattern-valid: Value '{ ../../ex:ncols ' is not facet-valid with respect to pattern '(\{[^\{].*\})|(\{\})' for type 'DFDLExpression'.
Schema context: file:/tmp/daffodil_tmp_3795703009612761354.dfdl.xsd. Location in /tmp/daffodil_tmp_3795703009612761354.dfdl.xsd.]
2013-09-26 22:07:20:317  edu.illinois.ncsa.daffodil.compiler.Compiler Error[Schema Definition Error: Error loading schema due to org.xml.sax.SAXParseException; lineNumber: 22; columnNumber: 196; cvc-attribute.3: The value '{ ../../ex:ncols ' of attribute 'dfdl:occursCount' on element 'xs:element' is not valid with respect to its type, 'DFDLExpression'.
Schema context: file:/tmp/daffodil_tmp_3795703009612761354.dfdl.xsd. Location in /tmp/daffodil_tmp_3795703009612761354.dfdl.xsd.]
predicate: empty sequence
2013-09-26 22:07:20:523  edu.illinois.ncsa.daffodil.compiler.Compiler Error[Compilation (ProcessorFactory) produced 2 errors/warnings.]
2013-09-26 22:07:20:524  edu.illinois.ncsa.daffodil.compiler.Compiler Error[Schema Definition Error: Error loading schema due to org.xml.sax.SAXParseException; lineNumber: 14; columnNumber: 79; cvc-enumeration-valid: Value 'hieroglyphs' is not facet-valid with respect to enumeration '[binary, text]'. It must be a value from the enumeration.
Schema context: file:/home/opensource/data/bamboo/xml-data/build-dir/DFDL-REV0-JOB1/daffodil-test/target/scala-2.9.2/test-classes/edu/illinois/ncsa/daffodil/section23/dfdl_expressions/expressions_broken.dfdl.xsd. Location in /home/opensource/data/bamboo/xml-data/build-dir/DFDL-REV0-JOB1/daffodil-test/target/scala-2.9.2/test-classes/edu/illinois/ncsa/daffodil/section23/dfdl_expressions/expressions_broken.dfdl.xsd.]
2013-09-26 22:07:20:524  edu.illinois.ncsa.daffodil.compiler.Compiler Error[Schema Definition Error: Error loading schema due to org.xml.sax.SAXParseException; lineNumber: 14; columnNumber: 79; cvc-attribute.3: The value 'hieroglyphs' of attribute 'representation' on element 'dfdl:element' is not valid with respect to its type, 'RepresentationEnum'.
Schema context: file:/home/opensource/data/bamboo/xml-data/build-dir/DFDL-REV0-JOB1/daffodil-test/target/scala-2.9.2/test-classes/edu/illinois/ncsa/daffodil/section23/dfdl_expressions/expressions_broken.dfdl.xsd. Location in /home/opensource/data/bamboo/xml-data/build-dir/DFDL-REV0-JOB1/daffodil-test/target/scala-2.9.2/test-classes/edu/illinois/ncsa/daffodil/section23/dfdl_expressions/expressions_broken.dfdl.xsd.]
2013-09-26 22:07:20:548  edu.illinois.ncsa.daffodil.compiler.Compiler Error[Compilation (ProcessorFactory) produced 2 errors/warnings.]
2013-09-26 22:07:20:548  edu.illinois.ncsa.daffodil.compiler.Compiler Error[Schema Definition Error: Error loading schema due to org.xml.sax.SAXParseException; lineNumber: 14; columnNumber: 72; cvc-enumeration-valid: Value 'TExT' is not facet-valid with respect to enumeration '[binary, text]'. It must be a value from the enumeration.
Schema context: file:/home/opensource/data/bamboo/xml-data/build-dir/DFDL-REV0-JOB1/daffodil-test/target/scala-2.9.2/test-classes/edu/illinois/ncsa/daffodil/section23/dfdl_expressions/expressions_broken_2.dfdl.xsd. Location in /home/opensource/data/bamboo/xml-data/build-dir/DFDL-REV0-JOB1/daffodil-test/target/scala-2.9.2/test-classes/edu/illinois/ncsa/daffodil/section23/dfdl_expressions/expressions_broken_2.dfdl.xsd.]
2013-09-26 22:07:20:548  edu.illinois.ncsa.daffodil.compiler.Compiler Error[Schema Definition Error: Error loading schema due to org.xml.sax.SAXParseException; lineNumber: 14; columnNumber: 72; cvc-attribute.3: The value 'TExT' of attribute 'representation' on element 'dfdl:element' is not valid with respect to its type, 'RepresentationEnum'.
Schema context: file:/home/opensource/data/bamboo/xml-data/build-dir/DFDL-REV0-JOB1/daffodil-test/target/scala-2.9.2/test-classes/edu/illinois/ncsa/daffodil/section23/dfdl_expressions/expressions_broken_2.dfdl.xsd. Location in /home/opensource/data/bamboo/xml-data/build-dir/DFDL-REV0-JOB1/daffodil-test/target/scala-2.9.2/test-classes/edu/illinois/ncsa/daffodil/section23/dfdl_expressions/expressions_broken_2.dfdl.xsd.]
2013-09-26 22:07:20:577  edu.illinois.ncsa.daffodil.compiler.Compiler Error[Compilation (ProcessorFactory) produced 2 errors/warnings.]
2013-09-26 22:07:20:577  edu.illinois.ncsa.daffodil.compiler.Compiler Error[Schema Definition Error: Error loading schema due to org.xml.sax.SAXParseException; lineNumber: 9; columnNumber: 86; cvc-enumeration-valid: Value '0' is not facet-valid with respect to enumeration '[yes, no]'. It must be a value from the enumeration.
Schema context: file:/home/opensource/data/bamboo/xml-data/build-dir/DFDL-REV0-JOB1/daffodil-test/target/scala-2.9.2/test-classes/edu/illinois/ncsa/daffodil/section23/dfdl_expressions/expressions_broken_3.dfdl.xsd. Location in /home/opensource/data/bamboo/xml-data/build-dir/DFDL-REV0-JOB1/daffodil-test/target/scala-2.9.2/test-classes/edu/illinois/ncsa/daffodil/section23/dfdl_expressions/expressions_broken_3.dfdl.xsd.]
2013-09-26 22:07:20:577  edu.illinois.ncsa.daffodil.compiler.Compiler Error[Schema Definition Error: Error loading schema due to org.xml.sax.SAXParseException; lineNumber: 9; columnNumber: 86; cvc-attribute.3: The value '0' of attribute 'documentFinalTerminatorCanBeMissing' on element 'dfdl:format' is not valid with respect to its type, 'YesNoEnum'.
Schema context: file:/home/opensource/data/bamboo/xml-data/build-dir/DFDL-REV0-JOB1/daffodil-test/target/scala-2.9.2/test-classes/edu/illinois/ncsa/daffodil/section23/dfdl_expressions/expressions_broken_3.dfdl.xsd. Location in /home/opensource/data/bamboo/xml-data/build-dir/DFDL-REV0-JOB1/daffodil-test/target/scala-2.9.2/test-classes/edu/illinois/ncsa/daffodil/section23/dfdl_expressions/expressions_broken_3.dfdl.xsd.]
predicate: xs:boolean: true
[oolagdebug] Evaluated SchemaSet@@requiredEvaluations to ().
[oolagdebug] Evaluating SchemaSet@@requiredEvaluations
[oolagdebug] Evaluated SchemaSet@@requiredEvaluations to ().
[oolagdebug] Evaluating SchemaSet@@requiredEvaluations
[oolagdebug] Evaluated SchemaSet@@requiredEvaluations to ().
[oolagdebug] Evaluating SchemaSet@@requiredEvaluations
[oolagdebug] Evaluated SchemaSet@@requiredEvaluations to ().
[oolagdebug] Evaluating SchemaSet@@requiredEvaluations
[oolagdebug] Evaluated SchemaSet@@requiredEvaluations to ().
[oolagdebug] Evaluating SchemaSet@@requiredEvaluations
[oolagdebug] Evaluated SchemaSet@@requiredEvaluations to ().
[oolagdebug] Evaluating SchemaSet@@requiredEvaluations
[oolagdebug] Evaluated SchemaSet@@requiredEvaluations to ().
[oolagdebug] Evaluating SchemaSet@@requiredEvaluations
[oolagdebug] Evaluated SchemaSet@@requiredEvaluations to ().
[oolagdebug] Evaluating SchemaSet@@requiredEvaluations
[oolagdebug] Evaluated SchemaSet@@requiredEvaluations to ().
[oolagdebug] Evaluating SchemaSet@@requiredEvaluations
[oolagdebug] Evaluated SchemaSet@@requiredEvaluations to ().
[oolagdebug] Evaluating SchemaSet@@requiredEvaluations
[oolagdebug] Evaluated SchemaSet@@requiredEvaluations to ().
[oolagdebug] Evaluating SchemaSet@@requiredEvaluations
[oolagdebug] Evaluated SchemaSet@@requiredEvaluations to ().
[oolagdebug] Evaluating SchemaSet@@requiredEvaluations
[oolagdebug] Evaluated SchemaSet@@requiredEvaluations to ().
[oolagdebug] Evaluating SchemaSet@@requiredEvaluations
[oolagdebug] Evaluated SchemaSet@@requiredEvaluations to ().
[oolagdebug] Evaluating SchemaSet@@requiredEvaluations
[oolagdebug] Evaluated SchemaSet@@requiredEvaluations to ().
[oolagdebug] Evaluating SchemaSet@@requiredEvaluations
[oolagdebug] Evaluated SchemaSet@@requiredEvaluations to ().
[oolagdebug] Evaluating SchemaSet@@requiredEvaluations
[oolagdebug] Evaluated SchemaSet@@requiredEvaluations to ().
[oolagdebug] Evaluating SchemaSet@@requiredEvaluations
[oolagdebug] Evaluated SchemaSet@@requiredEvaluations to ().
[oolagdebug] Evaluating SchemaSet@@requiredEvaluations
[oolagdebug] Evaluated SchemaSet@@requiredEvaluations to ().
[oolagdebug] Evaluating SchemaSet@@requiredEvaluations
[oolagdebug] Evaluated SchemaSet@@requiredEvaluations to ().
[oolagdebug] Evaluating SchemaSet@@requiredEvaluations
[oolagdebug] Evaluated SchemaSet@@requiredEvaluations to ().
[oolagdebug] Evaluating SchemaSet@@requiredEvaluations
[oolagdebug] Evaluated SchemaSet@@requiredEvaluations to ().
[oolagdebug] Evaluating SchemaSet@@requiredEvaluations
[oolagdebug] Evaluated SchemaSet@@requiredEvaluations to ().
[oolagdebug] Evaluating SchemaSet@@requiredEvaluations
[oolagdebug] Evaluated SchemaSet@@requiredEvaluations to ().
[oolagdebug] Evaluating SchemaSet@@requiredEvaluations
[oolagdebug] Evaluated SchemaSet@@requiredEvaluations to ().
[oolagdebug] Evaluating SchemaSet@@requiredEvaluations
[oolagdebug] Evaluated SchemaSet@@requiredEvaluations to ().
[oolagdebug] Evaluating SchemaSet@@requiredEvaluations
[oolagdebug] Evaluated SchemaSet@@requiredEvaluations to ().
[oolagdebug] Evaluating SchemaSet@@requiredEvaluations
[oolagdebug] Evaluated SchemaSet@@requiredEvaluations to ().
[oolagdebug] Evaluating SchemaSet@@requiredEvaluations
[oolagdebug] Evaluated SchemaSet@@requiredEvaluations to ().
[oolagdebug] Evaluating SchemaSet@@requiredEvaluations
[oolagdebug] Evaluated SchemaSet@@requiredEvaluations to ().
[error] Left over data. 3 bytes available. Location: byte 2
UTF-8 text starting at byte 0 is: (12
)
Data (hex) starting at byte 0 is: (0x31320A)
[error] Left over data. 6 bytes available. Location: byte 5
UTF-8 text starting at byte 0 is: (0,1,2
)
Data (hex) starting at byte 0 is: (0x302C312C320A)
[error] One of --schema or --parser must be defined
[error] --root must be defined if --namespace is defined
[error] Left over data. 6 bytes available. Location: byte 1
UTF-8 text starting at byte 0 is: (0,1,2
)
Data (hex) starting at byte 0 is: (0x302C312C320A)
[error] Left over data. 6 bytes available. Location: byte 0
UTF-8 text starting at byte 0 is: (0,1,2
)
Data (hex) starting at byte 0 is: (0x302C312C320A)
[error] Compilation (ProcessorFactory) produced 2 errors/warnings.
[error] Schema Definition Error: Error loading schema due to org.xml.sax.SAXParseException; lineNumber: 13; columnNumber: 79; cvc-datatype-valid.1.2.3: 'fixed' is not a valid value of union type 'allNNI'.
Schema context: file:/home/opensource/data/bamboo/xml-data/build-dir/DFDL-REV0-JOB1/daffodil-cli/src/test/resources/edu/illinois/ncsa/daffodil/CLI/ABC_IBM_invalid.xsd. Location in daffodil-cli/src/test/resources/edu/illinois/ncsa/daffodil/CLI/ABC_IBM_invalid.xsd.
[error] Schema Definition Error: Error loading schema due to org.xml.sax.SAXParseException; lineNumber: 13; columnNumber: 79; cvc-attribute.3: The value 'fixed' of attribute 'maxOccurs' on element 'xsd:element' is not valid with respect to its type, 'allNNI'.
Schema context: file:/home/opensource/data/bamboo/xml-data/build-dir/DFDL-REV0-JOB1/daffodil-cli/src/test/resources/edu/illinois/ncsa/daffodil/CLI/ABC_IBM_invalid.xsd. Location in daffodil-cli/src/test/resources/edu/illinois/ncsa/daffodil/CLI/ABC_IBM_invalid.xsd.
[error] Compilation (ProcessorFactory) produced 1 errors/warnings.
[error] Schema Definition Error: No root element found for unknown in any available namespace
Schema context: SchemaSet. Location in daffodil-test/src/test/resources/edu/illinois/ncsa/daffodil/section06/entities/charClassEntities.dfdl.xsd.
[warning] Using --debug on a non-interactive console may result in display issues
[warning] Using --debug on a non-interactive console may result in display issues
[warning] Using --debug on a non-interactive console may result in display issues
[warning] Using --debug on a non-interactive console may result in display issues
[warning] Using --debug on a non-interactive console may result in display issues
[warning] Using --debug on a non-interactive console may result in display issues
[warning] Using --debug on a non-interactive console may result in display issues
[warning] Using --debug on a non-interactive console may result in display issues
[warning] Using --debug on a non-interactive console may result in display issues
[warning] Using --debug on a non-interactive console may result in display issues
[warning] Using --debug on a non-interactive console may result in display issues
[warning] Using --debug on a non-interactive console may result in display issues
[warning] Using --debug on a non-interactive console may result in display issues
[warning] Using --debug on a non-interactive console may result in display issues
[warning] Using --debug on a non-interactive console may result in display issues