Build #319

Build: #319 failed Changes by Michelle Pitcel and Indira Gutierrez

Build result summary

Details

Completed
Duration
225 minutes
Labels
None
Agent
buildserver-2.os.ncsa.edu
Revision
5c369b7896cd478fe571274b01e987212e948fbd 5c369b7896cd478fe571274b01e987212e948fbd

No failed tests found, a possible compilation error occurred.

Responsible

Code commits

Author Commit Message Commit date
Indira Gutierrez Indira Gutierrez 5c369b7896cd478fe571274b01e987212e948fbd 5c369b7896cd478fe571274b01e987212e948fbd Fixing Changelog.
Indira Gutierrez Indira Gutierrez e95086538a952e57174f59210ca07e94a96d27fc e95086538a952e57174f59210ca07e94a96d27fc Updating release numbers
Michelle Pitcel Michelle Pitcel 68ac91830ce72f7286da2cbcad8a2b8cf8c385f1 68ac91830ce72f7286da2cbcad8a2b8cf8c385f1 Update NavBarView to handle Trends Dropdown Links properly
Indira Gutierrez Indira Gutierrez 2cea3c79fa922e38dc0f1903f21475a533c55e06 2cea3c79fa922e38dc0f1903f21475a533c55e06 Removing comments.
Indira Gutierrez Indira Gutierrez 931729028c7db9763ef297abadbc85e46217a813 931729028c7db9763ef297abadbc85e46217a813 Rollback accidental files from GLM

Error summary for Default Job

The job generated some errors, drill down into the full build log for more details.

npm http GET https://registry.npmjs.org/graceful-fs
npm http 304 https://registry.npmjs.org/rimraf
npm http 304 https://registry.npmjs.org/graceful-fs
npm WARN engine hawk@3.1.3: wanted: {"node":">=0.10.32"} (current: {"node":"v0.10.28","npm":"1.4.9"})
npm http GET https://registry.npmjs.org/glob
npm http 304 https://registry.npmjs.org/glob
npm http GET https://registry.npmjs.org/minimatch
npm http GET https://registry.npmjs.org/has-ansi
npm http GET https://registry.npmjs.org/ansi-styles
npm http GET https://registry.npmjs.org/escape-string-regexp
npm http GET https://registry.npmjs.org/strip-ansi
npm http GET https://registry.npmjs.org/supports-color
npm http GET https://registry.npmjs.org/universalify
npm http 304 https://registry.npmjs.org/minimatch
npm http 304 https://registry.npmjs.org/supports-color
npm http 304 https://registry.npmjs.org/universalify
npm http 304 https://registry.npmjs.org/ansi-styles
npm http 304 https://registry.npmjs.org/has-ansi
npm http 304 https://registry.npmjs.org/escape-string-regexp
npm http 304 https://registry.npmjs.org/strip-ansi
npm http GET https://registry.npmjs.org/growl
npm http GET https://registry.npmjs.org/jade
npm http GET https://registry.npmjs.org/diff
npm http 304 https://registry.npmjs.org/growl
npm http 304 https://registry.npmjs.org/jade
npm http 304 https://registry.npmjs.org/diff
npm WARN deprecated jade@0.26.3: Jade has been renamed to pug, please install the latest version of pug instead of jade
npm http GET https://registry.npmjs.org/ansi-regex
npm http 304 https://registry.npmjs.org/ansi-regex
npm http GET https://registry.npmjs.org/ms
npm http 200 https://registry.npmjs.org/ms
npm http GET https://registry.npmjs.org/inherits
npm WARN deprecated graceful-fs@2.0.3: graceful-fs v3.0.0 and before will fail on node releases >= v7.0. Please update to graceful-fs@^4.0.0 as soon as possible. Use 'npm ls graceful-fs' to find it in the tree.
npm http GET https://registry.npmjs.org/ms/-/ms-2.0.0.tgz
npm http 304 https://registry.npmjs.org/inherits
npm http 200 https://registry.npmjs.org/ms/-/ms-2.0.0.tgz
npm http GET https://registry.npmjs.org/lru-cache
npm http GET https://registry.npmjs.org/sigmund
npm http 304 https://registry.npmjs.org/lru-cache
npm http 304 https://registry.npmjs.org/sigmund
npm http GET https://registry.npmjs.org/mkdirp
npm http 304 https://registry.npmjs.org/mkdirp
npm http GET https://registry.npmjs.org/hoek
npm http GET https://registry.npmjs.org/boom
npm http GET https://registry.npmjs.org/sntp
npm http GET https://registry.npmjs.org/cryptiles
npm http 304 https://registry.npmjs.org/hoek
npm http 304 https://registry.npmjs.org/sntp
npm http 304 https://registry.npmjs.org/boom
npm http 304 https://registry.npmjs.org/cryptiles
npm WARN engine hoek@2.16.3: wanted: {"node":">=0.10.40"} (current: {"node":"v0.10.28","npm":"1.4.9"})
npm WARN engine boom@2.10.1: wanted: {"node":">=0.10.40"} (current: {"node":"v0.10.28","npm":"1.4.9"})
npm WARN engine cryptiles@2.0.5: wanted: {"node":">=0.10.40"} (current: {"node":"v0.10.28","npm":"1.4.9"})
npm WARN engine cryptiles@2.0.5: wanted: {"node":">=0.10.40"} (current: {"node":"v0.10.28","npm":"1.4.9"})
npm WARN engine hoek@2.16.3: wanted: {"node":">=0.10.40"} (current: {"node":"v0.10.28","npm":"1.4.9"})
npm WARN engine boom@2.10.1: wanted: {"node":">=0.10.40"} (current: {"node":"v0.10.28","npm":"1.4.9"})
npm http GET https://registry.npmjs.org/lodash
npm http 304 https://registry.npmjs.org/lodash
npm http GET https://registry.npmjs.org/core-util-is
npm http GET https://registry.npmjs.org/isarray
npm http GET https://registry.npmjs.org/string_decoder
npm http GET https://registry.npmjs.org/process-nextick-args
npm http GET https://registry.npmjs.org/util-deprecate
npm http GET https://registry.npmjs.org/asn1
npm http GET https://registry.npmjs.org/assert-plus
npm http GET https://registry.npmjs.org/getpass
npm http GET https://registry.npmjs.org/dashdash
npm http GET https://registry.npmjs.org/jsbn
npm http GET https://registry.npmjs.org/tweetnacl
npm http GET https://registry.npmjs.org/ecc-jsbn
npm http GET https://registry.npmjs.org/bcrypt-pbkdf
npm http 304 https://registry.npmjs.org/core-util-is
npm http 304 https://registry.npmjs.org/isarray
npm http 304 https://registry.npmjs.org/string_decoder
npm http 304 https://registry.npmjs.org/process-nextick-args
npm http 304 https://registry.npmjs.org/util-deprecate
npm http 304 https://registry.npmjs.org/asn1
npm http 304 https://registry.npmjs.org/assert-plus
npm http 304 https://registry.npmjs.org/getpass
npm http 304 https://registry.npmjs.org/dashdash
npm http 304 https://registry.npmjs.org/jsbn
npm http 304 https://registry.npmjs.org/tweetnacl
npm http 304 https://registry.npmjs.org/ecc-jsbn
npm http 304 https://registry.npmjs.org/bcrypt-pbkdf
npm http GET https://registry.npmjs.org/inherits
npm http 304 https://registry.npmjs.org/inherits
npm http GET https://registry.npmjs.org/generate-function
npm http GET https://registry.npmjs.org/generate-object-property
npm http GET https://registry.npmjs.org/xtend
npm http GET https://registry.npmjs.org/jsonpointer
npm http 304 https://registry.npmjs.org/xtend
npm http 304 https://registry.npmjs.org/generate-function
npm http 304 https://registry.npmjs.org/jsonpointer
npm http 304 https://registry.npmjs.org/generate-object-property
npm http GET https://registry.npmjs.org/is-property
npm http 304 https://registry.npmjs.org/is-property
npm ERR!
npm ERR! Additional logging details can be found in:
npm ERR!     /home/bamboo/bamboo-agent-home/xml-data/build-dir/GEOD-MAIN-JOB1/npm-debug.log
npm ERR! not ok code 0