Build: #1 failed First build for this plan

Test results

  • 99 tests in total
  • 25 tests failed
  • 25 failures are new
  • 8 seconds taken in total.
New test failures 25
Status Test View job Duration
Collapse Failed ApplicationControllerSpec The `index` action should::display the default cluster when no cluster provided History
Default Job < 1 sec
sbt.ForkMain$ForkError: com.google.inject.ProvisionException: Unable to provision, see the following errors:  1) Error injecting constructor, java.io.FileNotFoundException: 61647055_6hw17xyv_config.json (No such file or directory)   at services.BoxService.<init>(BoxService.scala:108)   while locating services.BoxService     for the 6th parameter of controllers.ApplicationController.<init>(ApplicationController.scala:36)   while locating controllers.ApplicationController     for the 2nd parameter of router.Routes.<init>(Routes.scala:50)   while locating router.Routes   while locating play.api.inject.RoutesProvider   while locating play.api.routing.Router     for the 1st parameter of play.api.http.JavaCompatibleHttpRequestHandler.<init>(HttpRequestHandler.scala:222)   while locating play.api.http.JavaCompatibleHttpRequestHandler   while locating play.api.http.HttpRequestHandler     for the 6th parameter of play.api.DefaultApplication.<init>(Application.scala:236)   at play.api.DefaultApplication.class(Application.scala:235)   while locating play.api.DefaultApplication   while locating play.api.Application  1 error
sbt.ForkMain$ForkError: com.google.inject.ProvisionException: Unable to provision, see the following errors:

1) Error injecting constructor, java.io.FileNotFoundException: 61647055_6hw17xyv_config.json (No such file or directory)
  at services.BoxService.<init>(BoxService.scala:108)
  while locating services.BoxService
    for the 6th parameter of controllers.ApplicationController.<init>(ApplicationController.scala:36)
  while locating controllers.ApplicationController
(82 more lines...)
Collapse Failed ApplicationControllerSpec The `index` action should::redirect to login page if user is unauthorized History
Default Job < 1 sec
sbt.ForkMain$ForkError: com.google.inject.ProvisionException: Unable to provision, see the following errors:  1) Error injecting constructor, java.io.FileNotFoundException: 61647055_6hw17xyv_config.json (No such file or directory)   at services.BoxService.<init>(BoxService.scala:108)   while locating services.BoxService     for the 6th parameter of controllers.ApplicationController.<init>(ApplicationController.scala:36)   while locating controllers.ApplicationController     for the 2nd parameter of router.Routes.<init>(Routes.scala:50)   while locating router.Routes   while locating play.api.inject.RoutesProvider   while locating play.api.routing.Router     for the 1st parameter of play.api.http.JavaCompatibleHttpRequestHandler.<init>(HttpRequestHandler.scala:222)   while locating play.api.http.JavaCompatibleHttpRequestHandler   while locating play.api.http.HttpRequestHandler     for the 6th parameter of play.api.DefaultApplication.<init>(Application.scala:236)   at play.api.DefaultApplication.class(Application.scala:235)   while locating play.api.DefaultApplication   while locating play.api.Application  1 error
sbt.ForkMain$ForkError: com.google.inject.ProvisionException: Unable to provision, see the following errors:

1) Error injecting constructor, java.io.FileNotFoundException: 61647055_6hw17xyv_config.json (No such file or directory)
  at services.BoxService.<init>(BoxService.scala:108)
  while locating services.BoxService
    for the 6th parameter of controllers.ApplicationController.<init>(ApplicationController.scala:36)
  while locating controllers.ApplicationController
(82 more lines...)
Collapse Failed ApplicationControllerSpec The `index` action should::return 200 if user is authorized History
Default Job < 1 sec
sbt.ForkMain$ForkError: com.google.inject.ProvisionException: Unable to provision, see the following errors:  1) Error injecting constructor, java.io.FileNotFoundException: 61647055_6hw17xyv_config.json (No such file or directory)   at services.BoxService.<init>(BoxService.scala:108)   while locating services.BoxService     for the 6th parameter of controllers.ApplicationController.<init>(ApplicationController.scala:36)   while locating controllers.ApplicationController     for the 2nd parameter of router.Routes.<init>(Routes.scala:50)   while locating router.Routes   while locating play.api.inject.RoutesProvider   while locating play.api.routing.Router     for the 1st parameter of play.api.http.JavaCompatibleHttpRequestHandler.<init>(HttpRequestHandler.scala:222)   while locating play.api.http.JavaCompatibleHttpRequestHandler   while locating play.api.http.HttpRequestHandler     for the 6th parameter of play.api.DefaultApplication.<init>(Application.scala:236)   at play.api.DefaultApplication.class(Application.scala:235)   while locating play.api.DefaultApplication   while locating play.api.Application  1 error
sbt.ForkMain$ForkError: com.google.inject.ProvisionException: Unable to provision, see the following errors:

1) Error injecting constructor, java.io.FileNotFoundException: 61647055_6hw17xyv_config.json (No such file or directory)
  at services.BoxService.<init>(BoxService.scala:108)
  while locating services.BoxService
    for the 6th parameter of controllers.ApplicationController.<init>(ApplicationController.scala:36)
  while locating controllers.ApplicationController
(82 more lines...)
Collapse Failed ApplicationControllerSpec The `index` action should::display the selected cluster when provided History
Default Job < 1 sec
sbt.ForkMain$ForkError: com.google.inject.ProvisionException: Unable to provision, see the following errors:  1) Error injecting constructor, java.io.FileNotFoundException: 61647055_6hw17xyv_config.json (No such file or directory)   at services.BoxService.<init>(BoxService.scala:108)   while locating services.BoxService     for the 6th parameter of controllers.ApplicationController.<init>(ApplicationController.scala:36)   while locating controllers.ApplicationController     for the 2nd parameter of router.Routes.<init>(Routes.scala:50)   while locating router.Routes   while locating play.api.inject.RoutesProvider   while locating play.api.routing.Router     for the 1st parameter of play.api.http.JavaCompatibleHttpRequestHandler.<init>(HttpRequestHandler.scala:222)   while locating play.api.http.JavaCompatibleHttpRequestHandler   while locating play.api.http.HttpRequestHandler     for the 6th parameter of play.api.DefaultApplication.<init>(Application.scala:236)   at play.api.DefaultApplication.class(Application.scala:235)   while locating play.api.DefaultApplication   while locating play.api.Application  1 error
sbt.ForkMain$ForkError: com.google.inject.ProvisionException: Unable to provision, see the following errors:

1) Error injecting constructor, java.io.FileNotFoundException: 61647055_6hw17xyv_config.json (No such file or directory)
  at services.BoxService.<init>(BoxService.scala:108)
  while locating services.BoxService
    for the 6th parameter of controllers.ApplicationController.<init>(ApplicationController.scala:36)
  while locating controllers.ApplicationController
(82 more lines...)
Collapse Failed ApplicationControllerSpec the 'signout' action should::redirect browser to home History
Default Job < 1 sec
sbt.ForkMain$ForkError: com.google.inject.ProvisionException: Unable to provision, see the following errors:  1) Error injecting constructor, java.io.FileNotFoundException: 61647055_6hw17xyv_config.json (No such file or directory)   at services.BoxService.<init>(BoxService.scala:108)   while locating services.BoxService     for the 6th parameter of controllers.ApplicationController.<init>(ApplicationController.scala:36)   while locating controllers.ApplicationController     for the 2nd parameter of router.Routes.<init>(Routes.scala:50)   while locating router.Routes   while locating play.api.inject.RoutesProvider   while locating play.api.routing.Router     for the 1st parameter of play.api.http.JavaCompatibleHttpRequestHandler.<init>(HttpRequestHandler.scala:222)   while locating play.api.http.JavaCompatibleHttpRequestHandler   while locating play.api.http.HttpRequestHandler     for the 6th parameter of play.api.DefaultApplication.<init>(Application.scala:236)   at play.api.DefaultApplication.class(Application.scala:235)   while locating play.api.DefaultApplication   while locating play.api.Application  1 error
sbt.ForkMain$ForkError: com.google.inject.ProvisionException: Unable to provision, see the following errors:

1) Error injecting constructor, java.io.FileNotFoundException: 61647055_6hw17xyv_config.json (No such file or directory)
  at services.BoxService.<init>(BoxService.scala:108)
  while locating services.BoxService
    for the 6th parameter of controllers.ApplicationController.<init>(ApplicationController.scala:36)
  while locating controllers.ApplicationController
(82 more lines...)
Collapse Failed ProjectsControllerSpec When I click on the bind button::Given there is a project on the projects tab::Then I should see the bind page for that project History
Default Job < 1 sec
sbt.ForkMain$ForkError: com.google.inject.ProvisionException: Unable to provision, see the following errors:  1) Error injecting constructor, java.io.FileNotFoundException: 61647055_6hw17xyv_config.json (No such file or directory)   at services.BoxService.<init>(BoxService.scala:108)   while locating services.BoxService     for the 6th parameter of controllers.ApplicationController.<init>(ApplicationController.scala:36)   while locating controllers.ApplicationController     for the 2nd parameter of router.Routes.<init>(Routes.scala:50)   while locating router.Routes   while locating play.api.inject.RoutesProvider   while locating play.api.routing.Router     for the 1st parameter of play.api.http.JavaCompatibleHttpRequestHandler.<init>(HttpRequestHandler.scala:222)   while locating play.api.http.JavaCompatibleHttpRequestHandler   while locating play.api.http.HttpRequestHandler     for the 6th parameter of play.api.DefaultApplication.<init>(Application.scala:236)   at play.api.DefaultApplication.class(Application.scala:235)   while locating play.api.DefaultApplication   while locating play.api.Application  1 error
sbt.ForkMain$ForkError: com.google.inject.ProvisionException: Unable to provision, see the following errors:

1) Error injecting constructor, java.io.FileNotFoundException: 61647055_6hw17xyv_config.json (No such file or directory)
  at services.BoxService.<init>(BoxService.scala:108)
  while locating services.BoxService
    for the 6th parameter of controllers.ApplicationController.<init>(ApplicationController.scala:36)
  while locating controllers.ApplicationController
(81 more lines...)
Collapse Failed ProjectsControllerSpec When I click submit::Given I am on the edit bindings page::Then I should accept my new settings History
Default Job < 1 sec
sbt.ForkMain$ForkError: com.google.inject.ProvisionException: Unable to provision, see the following errors:  1) Error injecting constructor, java.io.FileNotFoundException: 61647055_6hw17xyv_config.json (No such file or directory)   at services.BoxService.<init>(BoxService.scala:108)   while locating services.BoxService     for the 6th parameter of controllers.ApplicationController.<init>(ApplicationController.scala:36)   while locating controllers.ApplicationController     for the 2nd parameter of router.Routes.<init>(Routes.scala:50)   while locating router.Routes   while locating play.api.inject.RoutesProvider   while locating play.api.routing.Router     for the 1st parameter of play.api.http.JavaCompatibleHttpRequestHandler.<init>(HttpRequestHandler.scala:222)   while locating play.api.http.JavaCompatibleHttpRequestHandler   while locating play.api.http.HttpRequestHandler     for the 6th parameter of play.api.DefaultApplication.<init>(Application.scala:236)   at play.api.DefaultApplication.class(Application.scala:235)   while locating play.api.DefaultApplication   while locating play.api.Application  1 error
sbt.ForkMain$ForkError: com.google.inject.ProvisionException: Unable to provision, see the following errors:

1) Error injecting constructor, java.io.FileNotFoundException: 61647055_6hw17xyv_config.json (No such file or directory)
  at services.BoxService.<init>(BoxService.scala:108)
  while locating services.BoxService
    for the 6th parameter of controllers.ApplicationController.<init>(ApplicationController.scala:36)
  while locating controllers.ApplicationController
(81 more lines...)
Collapse Failed ProjectsControllerSpec When I click submit::Given I provide an invalid projectName::Then I receive an error History
Default Job < 1 sec
sbt.ForkMain$ForkError: com.google.inject.ProvisionException: Unable to provision, see the following errors:  1) Error injecting constructor, java.io.FileNotFoundException: 61647055_6hw17xyv_config.json (No such file or directory)   at services.BoxService.<init>(BoxService.scala:108)   while locating services.BoxService     for the 6th parameter of controllers.ApplicationController.<init>(ApplicationController.scala:36)   while locating controllers.ApplicationController     for the 2nd parameter of router.Routes.<init>(Routes.scala:50)   while locating router.Routes   while locating play.api.inject.RoutesProvider   while locating play.api.routing.Router     for the 1st parameter of play.api.http.JavaCompatibleHttpRequestHandler.<init>(HttpRequestHandler.scala:222)   while locating play.api.http.JavaCompatibleHttpRequestHandler   while locating play.api.http.HttpRequestHandler     for the 6th parameter of play.api.DefaultApplication.<init>(Application.scala:236)   at play.api.DefaultApplication.class(Application.scala:235)   while locating play.api.DefaultApplication   while locating play.api.Application  1 error
sbt.ForkMain$ForkError: com.google.inject.ProvisionException: Unable to provision, see the following errors:

1) Error injecting constructor, java.io.FileNotFoundException: 61647055_6hw17xyv_config.json (No such file or directory)
  at services.BoxService.<init>(BoxService.scala:108)
  while locating services.BoxService
    for the 6th parameter of controllers.ApplicationController.<init>(ApplicationController.scala:36)
  while locating controllers.ApplicationController
(85 more lines...)
Collapse Failed ProjectsControllerSpec When I click submit::Given I provide an a tool that doesn't exist::Then I receive an error History
Default Job < 1 sec
sbt.ForkMain$ForkError: com.google.inject.ProvisionException: Unable to provision, see the following errors:  1) Error injecting constructor, java.io.FileNotFoundException: 61647055_6hw17xyv_config.json (No such file or directory)   at services.BoxService.<init>(BoxService.scala:108)   while locating services.BoxService     for the 6th parameter of controllers.ApplicationController.<init>(ApplicationController.scala:36)   while locating controllers.ApplicationController     for the 2nd parameter of router.Routes.<init>(Routes.scala:50)   while locating router.Routes   while locating play.api.inject.RoutesProvider   while locating play.api.routing.Router     for the 1st parameter of play.api.http.JavaCompatibleHttpRequestHandler.<init>(HttpRequestHandler.scala:222)   while locating play.api.http.JavaCompatibleHttpRequestHandler   while locating play.api.http.HttpRequestHandler     for the 6th parameter of play.api.DefaultApplication.<init>(Application.scala:236)   at play.api.DefaultApplication.class(Application.scala:235)   while locating play.api.DefaultApplication   while locating play.api.Application  1 error
sbt.ForkMain$ForkError: com.google.inject.ProvisionException: Unable to provision, see the following errors:

1) Error injecting constructor, java.io.FileNotFoundException: 61647055_6hw17xyv_config.json (No such file or directory)
  at services.BoxService.<init>(BoxService.scala:108)
  while locating services.BoxService
    for the 6th parameter of controllers.ApplicationController.<init>(ApplicationController.scala:36)
  while locating controllers.ApplicationController
(85 more lines...)
Collapse Failed ProjectsControllerSpec When I click submit::Given I create invalid bindings::Then I receive an error History
Default Job < 1 sec
sbt.ForkMain$ForkError: com.google.inject.ProvisionException: Unable to provision, see the following errors:  1) Error injecting constructor, java.io.FileNotFoundException: 61647055_6hw17xyv_config.json (No such file or directory)   at services.BoxService.<init>(BoxService.scala:108)   while locating services.BoxService     for the 6th parameter of controllers.ApplicationController.<init>(ApplicationController.scala:36)   while locating controllers.ApplicationController     for the 2nd parameter of router.Routes.<init>(Routes.scala:50)   while locating router.Routes   while locating play.api.inject.RoutesProvider   while locating play.api.routing.Router     for the 1st parameter of play.api.http.JavaCompatibleHttpRequestHandler.<init>(HttpRequestHandler.scala:222)   while locating play.api.http.JavaCompatibleHttpRequestHandler   while locating play.api.http.HttpRequestHandler     for the 6th parameter of play.api.DefaultApplication.<init>(Application.scala:236)   at play.api.DefaultApplication.class(Application.scala:235)   while locating play.api.DefaultApplication   while locating play.api.Application  1 error
sbt.ForkMain$ForkError: com.google.inject.ProvisionException: Unable to provision, see the following errors:

1) Error injecting constructor, java.io.FileNotFoundException: 61647055_6hw17xyv_config.json (No such file or directory)
  at services.BoxService.<init>(BoxService.scala:108)
  while locating services.BoxService
    for the 6th parameter of controllers.ApplicationController.<init>(ApplicationController.scala:36)
  while locating controllers.ApplicationController
(85 more lines...)
Collapse Failed ProjectsControllerSpec When I click on the bind button::Given an invalid cluster setting::Then I should receive an error page History
Default Job < 1 sec
sbt.ForkMain$ForkError: com.google.inject.ProvisionException: Unable to provision, see the following errors:  1) Error injecting constructor, java.io.FileNotFoundException: 61647055_6hw17xyv_config.json (No such file or directory)   at services.BoxService.<init>(BoxService.scala:108)   while locating services.BoxService     for the 6th parameter of controllers.ApplicationController.<init>(ApplicationController.scala:36)   while locating controllers.ApplicationController     for the 2nd parameter of router.Routes.<init>(Routes.scala:50)   while locating router.Routes   while locating play.api.inject.RoutesProvider   while locating play.api.routing.Router     for the 1st parameter of play.api.http.JavaCompatibleHttpRequestHandler.<init>(HttpRequestHandler.scala:222)   while locating play.api.http.JavaCompatibleHttpRequestHandler   while locating play.api.http.HttpRequestHandler     for the 6th parameter of play.api.DefaultApplication.<init>(Application.scala:236)   at play.api.DefaultApplication.class(Application.scala:235)   while locating play.api.DefaultApplication   while locating play.api.Application  1 error
sbt.ForkMain$ForkError: com.google.inject.ProvisionException: Unable to provision, see the following errors:

1) Error injecting constructor, java.io.FileNotFoundException: 61647055_6hw17xyv_config.json (No such file or directory)
  at services.BoxService.<init>(BoxService.scala:108)
  while locating services.BoxService
    for the 6th parameter of controllers.ApplicationController.<init>(ApplicationController.scala:36)
  while locating controllers.ApplicationController
(85 more lines...)
Collapse Failed ProjectsControllerSpec When I click submit::Given I provide an invalid clusterName::Then I receive an error History
Default Job < 1 sec
sbt.ForkMain$ForkError: com.google.inject.ProvisionException: Unable to provision, see the following errors:  1) Error injecting constructor, java.io.FileNotFoundException: 61647055_6hw17xyv_config.json (No such file or directory)   at services.BoxService.<init>(BoxService.scala:108)   while locating services.BoxService     for the 6th parameter of controllers.ApplicationController.<init>(ApplicationController.scala:36)   while locating controllers.ApplicationController     for the 2nd parameter of router.Routes.<init>(Routes.scala:50)   while locating router.Routes   while locating play.api.inject.RoutesProvider   while locating play.api.routing.Router     for the 1st parameter of play.api.http.JavaCompatibleHttpRequestHandler.<init>(HttpRequestHandler.scala:222)   while locating play.api.http.JavaCompatibleHttpRequestHandler   while locating play.api.http.HttpRequestHandler     for the 6th parameter of play.api.DefaultApplication.<init>(Application.scala:236)   at play.api.DefaultApplication.class(Application.scala:235)   while locating play.api.DefaultApplication   while locating play.api.Application  1 error
sbt.ForkMain$ForkError: com.google.inject.ProvisionException: Unable to provision, see the following errors:

1) Error injecting constructor, java.io.FileNotFoundException: 61647055_6hw17xyv_config.json (No such file or directory)
  at services.BoxService.<init>(BoxService.scala:108)
  while locating services.BoxService
    for the 6th parameter of controllers.ApplicationController.<init>(ApplicationController.scala:36)
  while locating controllers.ApplicationController
(85 more lines...)
Collapse Failed SocialAuthControllerSpec social auth login should::redirect user to social auth providers page if not logged in History
Default Job < 1 sec
sbt.ForkMain$ForkError: com.google.inject.ProvisionException: Unable to provision, see the following errors:  1) Error injecting constructor, java.io.FileNotFoundException: 61647055_6hw17xyv_config.json (No such file or directory)   at services.BoxService.<init>(BoxService.scala:108)   while locating services.BoxService     for the 6th parameter of controllers.ApplicationController.<init>(ApplicationController.scala:36)   while locating controllers.ApplicationController     for the 2nd parameter of router.Routes.<init>(Routes.scala:50)   while locating router.Routes   while locating play.api.inject.RoutesProvider   while locating play.api.routing.Router     for the 1st parameter of play.api.http.JavaCompatibleHttpRequestHandler.<init>(HttpRequestHandler.scala:222)   while locating play.api.http.JavaCompatibleHttpRequestHandler   while locating play.api.http.HttpRequestHandler     for the 6th parameter of play.api.DefaultApplication.<init>(Application.scala:236)   at play.api.DefaultApplication.class(Application.scala:235)   while locating play.api.DefaultApplication   while locating play.api.Application  1 error
sbt.ForkMain$ForkError: com.google.inject.ProvisionException: Unable to provision, see the following errors:

1) Error injecting constructor, java.io.FileNotFoundException: 61647055_6hw17xyv_config.json (No such file or directory)
  at services.BoxService.<init>(BoxService.scala:108)
  while locating services.BoxService
    for the 6th parameter of controllers.ApplicationController.<init>(ApplicationController.scala:36)
  while locating controllers.ApplicationController
(82 more lines...)
Collapse Failed SocialAuthControllerSpec social auth login should::if user choose LDAP, redirect to login page History
Default Job < 1 sec
sbt.ForkMain$ForkError: com.google.inject.ProvisionException: Unable to provision, see the following errors:  1) Error injecting constructor, java.io.FileNotFoundException: 61647055_6hw17xyv_config.json (No such file or directory)   at services.BoxService.<init>(BoxService.scala:108)   while locating services.BoxService     for the 6th parameter of controllers.ApplicationController.<init>(ApplicationController.scala:36)   while locating controllers.ApplicationController     for the 2nd parameter of router.Routes.<init>(Routes.scala:50)   while locating router.Routes   while locating play.api.inject.RoutesProvider   while locating play.api.routing.Router     for the 1st parameter of play.api.http.JavaCompatibleHttpRequestHandler.<init>(HttpRequestHandler.scala:222)   while locating play.api.http.JavaCompatibleHttpRequestHandler   while locating play.api.http.HttpRequestHandler     for the 6th parameter of play.api.DefaultApplication.<init>(Application.scala:236)   at play.api.DefaultApplication.class(Application.scala:235)   while locating play.api.DefaultApplication   while locating play.api.Application  1 error
sbt.ForkMain$ForkError: com.google.inject.ProvisionException: Unable to provision, see the following errors:

1) Error injecting constructor, java.io.FileNotFoundException: 61647055_6hw17xyv_config.json (No such file or directory)
  at services.BoxService.<init>(BoxService.scala:108)
  while locating services.BoxService
    for the 6th parameter of controllers.ApplicationController.<init>(ApplicationController.scala:36)
  while locating controllers.ApplicationController
(82 more lines...)
Collapse Failed SocialAuthControllerSpec social auth login should::POST to ldapauthenticate and redirect to home page History
Default Job < 1 sec
sbt.ForkMain$ForkError: com.google.inject.ProvisionException: Unable to provision, see the following errors:  1) Error injecting constructor, java.io.FileNotFoundException: 61647055_6hw17xyv_config.json (No such file or directory)   at services.BoxService.<init>(BoxService.scala:108)   while locating services.BoxService     for the 6th parameter of controllers.ApplicationController.<init>(ApplicationController.scala:36)   while locating controllers.ApplicationController     for the 2nd parameter of router.Routes.<init>(Routes.scala:50)   while locating router.Routes   while locating play.api.inject.RoutesProvider   while locating play.api.routing.Router     for the 1st parameter of play.api.http.JavaCompatibleHttpRequestHandler.<init>(HttpRequestHandler.scala:222)   while locating play.api.http.JavaCompatibleHttpRequestHandler   while locating play.api.http.HttpRequestHandler     for the 6th parameter of play.api.DefaultApplication.<init>(Application.scala:236)   at play.api.DefaultApplication.class(Application.scala:235)   while locating play.api.DefaultApplication   while locating play.api.Application  1 error
sbt.ForkMain$ForkError: com.google.inject.ProvisionException: Unable to provision, see the following errors:

1) Error injecting constructor, java.io.FileNotFoundException: 61647055_6hw17xyv_config.json (No such file or directory)
  at services.BoxService.<init>(BoxService.scala:108)
  while locating services.BoxService
    for the 6th parameter of controllers.ApplicationController.<init>(ApplicationController.scala:36)
  while locating controllers.ApplicationController
(82 more lines...)
Collapse Failed SocialAuthControllerSpec social auth login should::Ask user to try again if the provider is not in the registry History
Default Job < 1 sec
sbt.ForkMain$ForkError: com.google.inject.ProvisionException: Unable to provision, see the following errors:  1) Error injecting constructor, java.io.FileNotFoundException: 61647055_6hw17xyv_config.json (No such file or directory)   at services.BoxService.<init>(BoxService.scala:108)   while locating services.BoxService     for the 6th parameter of controllers.ApplicationController.<init>(ApplicationController.scala:36)   while locating controllers.ApplicationController     for the 2nd parameter of router.Routes.<init>(Routes.scala:50)   while locating router.Routes   while locating play.api.inject.RoutesProvider   while locating play.api.routing.Router     for the 1st parameter of play.api.http.JavaCompatibleHttpRequestHandler.<init>(HttpRequestHandler.scala:222)   while locating play.api.http.JavaCompatibleHttpRequestHandler   while locating play.api.http.HttpRequestHandler     for the 6th parameter of play.api.DefaultApplication.<init>(Application.scala:236)   at play.api.DefaultApplication.class(Application.scala:235)   while locating play.api.DefaultApplication   while locating play.api.Application  1 error
sbt.ForkMain$ForkError: com.google.inject.ProvisionException: Unable to provision, see the following errors:

1) Error injecting constructor, java.io.FileNotFoundException: 61647055_6hw17xyv_config.json (No such file or directory)
  at services.BoxService.<init>(BoxService.scala:108)
  while locating services.BoxService
    for the 6th parameter of controllers.ApplicationController.<init>(ApplicationController.scala:36)
  while locating controllers.ApplicationController
(82 more lines...)
Collapse Failed ToolsControllerSpec When I click on the 'Next' button::Given I have selected a tool with an invalid description in tools catalog::Then I should see an BadRequest result History
Default Job < 1 sec
sbt.ForkMain$ForkError: com.google.inject.ProvisionException: Unable to provision, see the following errors:  1) Error injecting constructor, java.io.FileNotFoundException: 61647055_6hw17xyv_config.json (No such file or directory)   at services.BoxService.<init>(BoxService.scala:108)   while locating services.BoxService     for the 6th parameter of controllers.ApplicationController.<init>(ApplicationController.scala:36)   while locating controllers.ApplicationController     for the 2nd parameter of router.Routes.<init>(Routes.scala:50)   while locating router.Routes   while locating play.api.inject.RoutesProvider   while locating play.api.routing.Router     for the 1st parameter of play.api.http.JavaCompatibleHttpRequestHandler.<init>(HttpRequestHandler.scala:222)   while locating play.api.http.JavaCompatibleHttpRequestHandler   while locating play.api.http.HttpRequestHandler     for the 6th parameter of play.api.DefaultApplication.<init>(Application.scala:236)   at play.api.DefaultApplication.class(Application.scala:235)   while locating play.api.DefaultApplication   while locating play.api.Application  1 error
sbt.ForkMain$ForkError: com.google.inject.ProvisionException: Unable to provision, see the following errors:

1) Error injecting constructor, java.io.FileNotFoundException: 61647055_6hw17xyv_config.json (No such file or directory)
  at services.BoxService.<init>(BoxService.scala:108)
  while locating services.BoxService
    for the 6th parameter of controllers.ApplicationController.<init>(ApplicationController.scala:36)
  while locating controllers.ApplicationController
(81 more lines...)
Collapse Failed ToolsControllerSpec When I click on the 'Next' button::And the tool is missing a parameters::Given I have selected a tool to deploy::Then I should see a form with the deployment parameters populated History
Default Job < 1 sec
sbt.ForkMain$ForkError: com.google.inject.ProvisionException: Unable to provision, see the following errors:  1) Error injecting constructor, java.io.FileNotFoundException: 61647055_6hw17xyv_config.json (No such file or directory)   at services.BoxService.<init>(BoxService.scala:108)   while locating services.BoxService     for the 6th parameter of controllers.ApplicationController.<init>(ApplicationController.scala:36)   while locating controllers.ApplicationController     for the 2nd parameter of router.Routes.<init>(Routes.scala:50)   while locating router.Routes   while locating play.api.inject.RoutesProvider   while locating play.api.routing.Router     for the 1st parameter of play.api.http.JavaCompatibleHttpRequestHandler.<init>(HttpRequestHandler.scala:222)   while locating play.api.http.JavaCompatibleHttpRequestHandler   while locating play.api.http.HttpRequestHandler     for the 6th parameter of play.api.DefaultApplication.<init>(Application.scala:236)   at play.api.DefaultApplication.class(Application.scala:235)   while locating play.api.DefaultApplication   while locating play.api.Application  1 error
sbt.ForkMain$ForkError: com.google.inject.ProvisionException: Unable to provision, see the following errors:

1) Error injecting constructor, java.io.FileNotFoundException: 61647055_6hw17xyv_config.json (No such file or directory)
  at services.BoxService.<init>(BoxService.scala:108)
  while locating services.BoxService
    for the 6th parameter of controllers.ApplicationController.<init>(ApplicationController.scala:36)
  while locating controllers.ApplicationController
(81 more lines...)
Collapse Failed ToolsControllerSpec When I click on the 'Next' button::And the tool is missing a docker image::Given I have selected a tool to deploy::Then I should see a form with the deployment parameters populated History
Default Job < 1 sec
sbt.ForkMain$ForkError: com.google.inject.ProvisionException: Unable to provision, see the following errors:  1) Error injecting constructor, java.io.FileNotFoundException: 61647055_6hw17xyv_config.json (No such file or directory)   at services.BoxService.<init>(BoxService.scala:108)   while locating services.BoxService     for the 6th parameter of controllers.ApplicationController.<init>(ApplicationController.scala:36)   while locating controllers.ApplicationController     for the 2nd parameter of router.Routes.<init>(Routes.scala:50)   while locating router.Routes   while locating play.api.inject.RoutesProvider   while locating play.api.routing.Router     for the 1st parameter of play.api.http.JavaCompatibleHttpRequestHandler.<init>(HttpRequestHandler.scala:222)   while locating play.api.http.JavaCompatibleHttpRequestHandler   while locating play.api.http.HttpRequestHandler     for the 6th parameter of play.api.DefaultApplication.<init>(Application.scala:236)   at play.api.DefaultApplication.class(Application.scala:235)   while locating play.api.DefaultApplication   while locating play.api.Application  1 error
sbt.ForkMain$ForkError: com.google.inject.ProvisionException: Unable to provision, see the following errors:

1) Error injecting constructor, java.io.FileNotFoundException: 61647055_6hw17xyv_config.json (No such file or directory)
  at services.BoxService.<init>(BoxService.scala:108)
  while locating services.BoxService
    for the 6th parameter of controllers.ApplicationController.<init>(ApplicationController.scala:36)
  while locating controllers.ApplicationController
(81 more lines...)
Collapse Failed ToolsControllerSpec When I click 'deploy' button::And the parameters will cause an error in clusterstats::Given I have entered correct deployment parameters::Then I should see an error History
Default Job < 1 sec
sbt.ForkMain$ForkError: com.google.inject.ProvisionException: Unable to provision, see the following errors:  1) Error injecting constructor, java.io.FileNotFoundException: 61647055_6hw17xyv_config.json (No such file or directory)   at services.BoxService.<init>(BoxService.scala:108)   while locating services.BoxService     for the 6th parameter of controllers.ApplicationController.<init>(ApplicationController.scala:36)   while locating controllers.ApplicationController     for the 2nd parameter of router.Routes.<init>(Routes.scala:50)   while locating router.Routes   while locating play.api.inject.RoutesProvider   while locating play.api.routing.Router     for the 1st parameter of play.api.http.JavaCompatibleHttpRequestHandler.<init>(HttpRequestHandler.scala:222)   while locating play.api.http.JavaCompatibleHttpRequestHandler   while locating play.api.http.HttpRequestHandler     for the 6th parameter of play.api.DefaultApplication.<init>(Application.scala:236)   at play.api.DefaultApplication.class(Application.scala:235)   while locating play.api.DefaultApplication   while locating play.api.Application  1 error
sbt.ForkMain$ForkError: com.google.inject.ProvisionException: Unable to provision, see the following errors:

1) Error injecting constructor, java.io.FileNotFoundException: 61647055_6hw17xyv_config.json (No such file or directory)
  at services.BoxService.<init>(BoxService.scala:108)
  while locating services.BoxService
    for the 6th parameter of controllers.ApplicationController.<init>(ApplicationController.scala:36)
  while locating controllers.ApplicationController
(81 more lines...)
Collapse Failed ToolsControllerSpec When I click deploy::And I have selected an unknown cluster::Given I have incorrectly populated the deploy form::Then I should see the error of my ways History
Default Job < 1 sec
sbt.ForkMain$ForkError: com.google.inject.ProvisionException: Unable to provision, see the following errors:  1) Error injecting constructor, java.io.FileNotFoundException: 61647055_6hw17xyv_config.json (No such file or directory)   at services.BoxService.<init>(BoxService.scala:108)   while locating services.BoxService     for the 6th parameter of controllers.ApplicationController.<init>(ApplicationController.scala:36)   while locating controllers.ApplicationController     for the 2nd parameter of router.Routes.<init>(Routes.scala:50)   while locating router.Routes   while locating play.api.inject.RoutesProvider   while locating play.api.routing.Router     for the 1st parameter of play.api.http.JavaCompatibleHttpRequestHandler.<init>(HttpRequestHandler.scala:222)   while locating play.api.http.JavaCompatibleHttpRequestHandler   while locating play.api.http.HttpRequestHandler     for the 6th parameter of play.api.DefaultApplication.<init>(Application.scala:236)   at play.api.DefaultApplication.class(Application.scala:235)   while locating play.api.DefaultApplication   while locating play.api.Application  1 error
sbt.ForkMain$ForkError: com.google.inject.ProvisionException: Unable to provision, see the following errors:

1) Error injecting constructor, java.io.FileNotFoundException: 61647055_6hw17xyv_config.json (No such file or directory)
  at services.BoxService.<init>(BoxService.scala:108)
  while locating services.BoxService
    for the 6th parameter of controllers.ApplicationController.<init>(ApplicationController.scala:36)
  while locating controllers.ApplicationController
(81 more lines...)
Collapse Failed ToolsControllerSpec When I click on the deploy button::Given there is a cluster::Then I should see the deploy page History
Default Job 4 secs
sbt.ForkMain$ForkError: com.google.inject.ProvisionException: Unable to provision, see the following errors:  1) Error injecting constructor, java.io.FileNotFoundException: 61647055_6hw17xyv_config.json (No such file or directory)   at services.BoxService.<init>(BoxService.scala:108)   while locating services.BoxService     for the 6th parameter of controllers.ApplicationController.<init>(ApplicationController.scala:36)   while locating controllers.ApplicationController     for the 2nd parameter of router.Routes.<init>(Routes.scala:50)   while locating router.Routes   while locating play.api.inject.RoutesProvider   while locating play.api.routing.Router     for the 1st parameter of play.api.http.JavaCompatibleHttpRequestHandler.<init>(HttpRequestHandler.scala:222)   while locating play.api.http.JavaCompatibleHttpRequestHandler   while locating play.api.http.HttpRequestHandler     for the 6th parameter of play.api.DefaultApplication.<init>(Application.scala:236)   at play.api.DefaultApplication.class(Application.scala:235)   while locating play.api.DefaultApplication   while locating play.api.Application  1 error
sbt.ForkMain$ForkError: com.google.inject.ProvisionException: Unable to provision, see the following errors:

1) Error injecting constructor, java.io.FileNotFoundException: 61647055_6hw17xyv_config.json (No such file or directory)
  at services.BoxService.<init>(BoxService.scala:108)
  while locating services.BoxService
    for the 6th parameter of controllers.ApplicationController.<init>(ApplicationController.scala:36)
  while locating controllers.ApplicationController
(81 more lines...)
Collapse Failed ToolsControllerSpec When I click deploy::Given I have incorrectly populated the deploy form::Then I should see the error of my ways History
Default Job < 1 sec
sbt.ForkMain$ForkError: com.google.inject.ProvisionException: Unable to provision, see the following errors:  1) Error injecting constructor, java.io.FileNotFoundException: 61647055_6hw17xyv_config.json (No such file or directory)   at services.BoxService.<init>(BoxService.scala:108)   while locating services.BoxService     for the 6th parameter of controllers.ApplicationController.<init>(ApplicationController.scala:36)   while locating controllers.ApplicationController     for the 2nd parameter of router.Routes.<init>(Routes.scala:50)   while locating router.Routes   while locating play.api.inject.RoutesProvider   while locating play.api.routing.Router     for the 1st parameter of play.api.http.JavaCompatibleHttpRequestHandler.<init>(HttpRequestHandler.scala:222)   while locating play.api.http.JavaCompatibleHttpRequestHandler   while locating play.api.http.HttpRequestHandler     for the 6th parameter of play.api.DefaultApplication.<init>(Application.scala:236)   at play.api.DefaultApplication.class(Application.scala:235)   while locating play.api.DefaultApplication   while locating play.api.Application  1 error
sbt.ForkMain$ForkError: com.google.inject.ProvisionException: Unable to provision, see the following errors:

1) Error injecting constructor, java.io.FileNotFoundException: 61647055_6hw17xyv_config.json (No such file or directory)
  at services.BoxService.<init>(BoxService.scala:108)
  while locating services.BoxService
    for the 6th parameter of controllers.ApplicationController.<init>(ApplicationController.scala:36)
  while locating controllers.ApplicationController
(81 more lines...)
Collapse Failed ToolsControllerSpec When I click 'deploy' button::Given I have entered correct deployment parameters::Then Clusterman should submit the request to clusterstats History
Default Job < 1 sec
sbt.ForkMain$ForkError: com.google.inject.ProvisionException: Unable to provision, see the following errors:  1) Error injecting constructor, java.io.FileNotFoundException: 61647055_6hw17xyv_config.json (No such file or directory)   at services.BoxService.<init>(BoxService.scala:108)   while locating services.BoxService     for the 6th parameter of controllers.ApplicationController.<init>(ApplicationController.scala:36)   while locating controllers.ApplicationController     for the 2nd parameter of router.Routes.<init>(Routes.scala:50)   while locating router.Routes   while locating play.api.inject.RoutesProvider   while locating play.api.routing.Router     for the 1st parameter of play.api.http.JavaCompatibleHttpRequestHandler.<init>(HttpRequestHandler.scala:222)   while locating play.api.http.JavaCompatibleHttpRequestHandler   while locating play.api.http.HttpRequestHandler     for the 6th parameter of play.api.DefaultApplication.<init>(Application.scala:236)   at play.api.DefaultApplication.class(Application.scala:235)   while locating play.api.DefaultApplication   while locating play.api.Application  1 error
sbt.ForkMain$ForkError: com.google.inject.ProvisionException: Unable to provision, see the following errors:

1) Error injecting constructor, java.io.FileNotFoundException: 61647055_6hw17xyv_config.json (No such file or directory)
  at services.BoxService.<init>(BoxService.scala:108)
  while locating services.BoxService
    for the 6th parameter of controllers.ApplicationController.<init>(ApplicationController.scala:36)
  while locating controllers.ApplicationController
(81 more lines...)
Collapse Failed ToolsControllerSpec When I click on the 'Next' button::Given I have selected a tool to deploy::Then I should see a form with the deployment parameters populated History
Default Job < 1 sec
sbt.ForkMain$ForkError: com.google.inject.ProvisionException: Unable to provision, see the following errors:  1) Error injecting constructor, java.io.FileNotFoundException: 61647055_6hw17xyv_config.json (No such file or directory)   at services.BoxService.<init>(BoxService.scala:108)   while locating services.BoxService     for the 6th parameter of controllers.ApplicationController.<init>(ApplicationController.scala:36)   while locating controllers.ApplicationController     for the 2nd parameter of router.Routes.<init>(Routes.scala:50)   while locating router.Routes   while locating play.api.inject.RoutesProvider   while locating play.api.routing.Router     for the 1st parameter of play.api.http.JavaCompatibleHttpRequestHandler.<init>(HttpRequestHandler.scala:222)   while locating play.api.http.JavaCompatibleHttpRequestHandler   while locating play.api.http.HttpRequestHandler     for the 6th parameter of play.api.DefaultApplication.<init>(Application.scala:236)   at play.api.DefaultApplication.class(Application.scala:235)   while locating play.api.DefaultApplication   while locating play.api.Application  1 error
sbt.ForkMain$ForkError: com.google.inject.ProvisionException: Unable to provision, see the following errors:

1) Error injecting constructor, java.io.FileNotFoundException: 61647055_6hw17xyv_config.json (No such file or directory)
  at services.BoxService.<init>(BoxService.scala:108)
  while locating services.BoxService
    for the 6th parameter of controllers.ApplicationController.<init>(ApplicationController.scala:36)
  while locating controllers.ApplicationController
(81 more lines...)