Build: #2 failed

Job: Default Job failed

Stages & jobs

  1. Default Stage

Build log

The build generated 990 lines of output. Download or view full build log

19-Oct-2017 08:56:07 Build BrownDog - Tool Catalog - feature-BD-1801-spike-investigate-upgrading-tools - Default Job #2 (BD-TC90-JOB1-2) started building on agent buildserver-3.os.ncsa.edu
19-Oct-2017 08:56:07 Remote agent on host buildserver-3.os.ncsa.edu
19-Oct-2017 08:56:07 Build working directory is /home/bamboo/bamboo-agent-home/xml-data/build-dir/BD-TC90-JOB1
19-Oct-2017 08:56:07 Executing build BrownDog - Tool Catalog - feature-BD-1801-spike-investigate-upgrading-tools - Default Job #2 (BD-TC90-JOB1-2)
19-Oct-2017 08:56:07 Starting task 'Checkout Default Repository' of type 'com.atlassian.bamboo.plugins.vcs:task.vcs.checkout'
19-Oct-2017 08:56:07 Updating source code to revision: 7c408ba5bc8f5eb0016eab55afa7724184f29c75
19-Oct-2017 08:56:07 Creating local git repository in '/home/bamboo/bamboo-agent-home/xml-data/build-dir/BD-TC90-JOB1/.git'.
19-Oct-2017 08:56:07 Initialized empty Git repository in /home/bamboo/bamboo-agent-home/xml-data/build-dir/BD-TC90-JOB1/.git/
19-Oct-2017 08:56:07 Fetching 'refs/heads/feature/BD-1801-spike-investigate-upgrading-tools' from 'ssh://git@opensource.ncsa.illinois.edu:7999/bd/tools-catalog.git'. Will try to do a shallow fetch.
19-Oct-2017 08:56:07 Warning: Permanently added '[127.0.0.1]:36177' (RSA) to the list of known hosts.
19-Oct-2017 08:56:08 From ssh://127.0.0.1:36177/bd/tools-catalog
19-Oct-2017 08:56:08 * [new branch]      feature/BD-1801-spike-investigate-upgrading-tools -> feature/BD-1801-spike-investigate-upgrading-tools
19-Oct-2017 08:56:08 Checking out revision 7c408ba5bc8f5eb0016eab55afa7724184f29c75.
19-Oct-2017 08:56:08 Switched to branch 'feature/BD-1801-spike-investigate-upgrading-tools'
19-Oct-2017 08:56:08 Updated source code to revision: 7c408ba5bc8f5eb0016eab55afa7724184f29c75
19-Oct-2017 08:56:08 Finished task 'Checkout Default Repository' with result: Success
19-Oct-2017 08:56:08 Running pre-build action: VCS Version Collector
19-Oct-2017 08:56:08 Starting task 'clean update' of type 'com.atlassian.bamboo.plugins.scripttask:task.builder.command'
19-Oct-2017 08:56:08
Beginning to execute external process for build 'BrownDog - Tool Catalog - feature-BD-1801-spike-investigate-upgrading-tools - Default Job #2 (BD-TC90-JOB1-2)'
... running command line:
/home/bamboo/sbt-0.13.2/bin/sbt clean update
... in: /home/bamboo/bamboo-agent-home/xml-data/build-dir/BD-TC90-JOB1
... using extra environment variables:
bamboo_planRepository_1_branch=feature/BD-1801-spike-investigate-upgrading-tools
bamboo_capability_system_builder_node_Node_js_v6_9_1=/home/bamboo/node-v6.9.1/bin/node
bamboo_capability_system_builder_command_npm_6=/home/bamboo/node-v6.9.1/bin/npm
bamboo_capability_system_builder_command_buckminster_4_3=/home/bamboo/buckminster-4.3/buckminster
bamboo_repository_150601740_name=tools-catalog
bamboo_capability_system_builder_command_buckminster_4_2=/home/bamboo/buckminster-4.2/buckminster
bamboo_repository_150601740_git_username=
bamboo_planRepository_1_branchDisplayName=feature/BD-1801-spike-investigate-upgrading-tools
bamboo_repository_revision_number=7c408ba5bc8f5eb0016eab55afa7724184f29c75
bamboo_resultsUrl=https://opensource.ncsa.illinois.edu/bamboo/browse/BD-TC90-JOB1-2
bamboo_capability_system_builder_command_sphinx=/usr/bin/sphinx-build
bamboo_planRepository_1_name=tools-catalog
bamboo_build_working_directory=/home/bamboo/bamboo-agent-home/xml-data/build-dir/BD-TC90-JOB1
bamboo_buildKey=BD-TC90-JOB1
bamboo_capability_system_os=linux
bamboo_shortPlanName=feature-BD-1801-spike-investigate-upgrading-tools
bamboo_planRepository_name=tools-catalog
bamboo_buildNumber=2
bamboo_shortJobName=Default Job
bamboo_buildResultsUrl=https://opensource.ncsa.illinois.edu/bamboo/browse/BD-TC90-JOB1-2
bamboo_planRepository_repositoryUrl=ssh://git@opensource.ncsa.illinois.edu:7999/bd/tools-catalog.git
bamboo_agentId=143032321
bamboo_planName=BrownDog - Tool Catalog - feature-BD-1801-spike-investigate-upgrading-tools
bamboo_repository_150601740_branch_name=feature/BD-1801-spike-investigate-upgrading-tools
bamboo_shortPlanKey=TC90
bamboo_capability_system_builder_command_sbt_0_13=/home/bamboo/sbt-0.13.2/bin/sbt
bamboo_shortJobKey=JOB1
bamboo_capability_system_builder_node_Node_js_v0_10_28=/home/bamboo/node-v0.10.28/bin/node
bamboo_repository_150601740_git_branch=feature/BD-1801-spike-investigate-upgrading-tools
bamboo_repository_150601740_git_repositoryUrl=ssh://git@opensource.ncsa.illinois.edu:7999/bd/tools-catalog.git
bamboo_planRepository_revision=7c408ba5bc8f5eb0016eab55afa7724184f29c75
bamboo_repository_previous_revision_number=891fa10ebe7602690af47b153f8cc67b9dbe1b7a
bamboo_buildTimeStamp=2017-10-19T08:56:07.537-05:00
bamboo_capability_system_builder_command_npm=/home/bamboo/node-v0.10.28/bin/npm
bamboo_repository_150601740_revision_number=7c408ba5bc8f5eb0016eab55afa7724184f29c75
bamboo_planRepository_previousRevision=891fa10ebe7602690af47b153f8cc67b9dbe1b7a
bamboo_capability_system_builder_mvn2_Maven_2=/home/bamboo/apache-maven-2.2.1
bamboo_buildResultKey=BD-TC90-JOB1-2
bamboo_repository_git_branch=feature/BD-1801-spike-investigate-upgrading-tools
bamboo_repository_branch_name=feature/BD-1801-spike-investigate-upgrading-tools
bamboo_buildPlanName=BrownDog - Tool Catalog - feature-BD-1801-spike-investigate-upgrading-tools - Default Job
bamboo_planRepository_1_revision=7c408ba5bc8f5eb0016eab55afa7724184f29c75
bamboo_capability_system_builder_command_python3=/usr/bin/python3
bamboo_repository_name=tools-catalog
bamboo_repository_150601740_previous_revision_number=891fa10ebe7602690af47b153f8cc67b9dbe1b7a
bamboo_buildFailed=false
bamboo_capability_system_docker_executable=/usr/bin/docker
bamboo_capability_system_builder_command_grunt=/home/bamboo/node-v0.10.28/bin/grunt
bamboo_planRepository_branch=feature/BD-1801-spike-investigate-upgrading-tools
bamboo_agentWorkingDirectory=/home/bamboo/bamboo-agent-home/xml-data/build-dir
bamboo_capability_system_git_executable=/usr/bin/git
bamboo_planRepository_1_previousRevision=891fa10ebe7602690af47b153f8cc67b9dbe1b7a
bamboo_repository_git_username=
bamboo_capability_system_builder_sbt_SBT_0_13_13=/home/bamboo/sbt-0.13.13
bamboo_planRepository_branchDisplayName=feature/BD-1801-spike-investigate-upgrading-tools
bamboo_capability_system_builder_command_phantomjs=/home/bamboo/phantomjs-1.9.8/bin/phantomjs
bamboo_planRepository_1_type=bbserver
bamboo_planRepository_branchName=feature/BD-1801-spike-investigate-upgrading-tools
bamboo_capability_system_builder_command_python2_7=/usr/bin/python2.7
bamboo_capability_system_hostname=buildserver-1
bamboo_capability_system_jdk_JDK=/home/bamboo/jdk1.8.0_66
bamboo_capability_system_software_mongo=/usr/bin/mongo
bamboo_plan_storageTag=plan-150405143
bamboo_capability_system_software_rabbitmq=/usr/sbin/rabbitmqctl
bamboo_capability_system_builder_command_casperjs=/home/bamboo/node-v0.10.28/bin/casperjs
bamboo_planRepository_type=bbserver
bamboo_planRepository_1_username=
bamboo_capability_system_jdk_JDK_1_8_0_66=/home/bamboo/jdk1.8.0_66
bamboo_repository_git_repositoryUrl=ssh://git@opensource.ncsa.illinois.edu:7999/bd/tools-catalog.git
bamboo_capability_system_builder_node_Node_js=/home/bamboo/node-v0.10.28/bin/node
bamboo_capability_system_builder_ant_Ant=/home/bamboo/apache-ant-1.9.4
bamboo_capability_system_builder_mvn3_Maven_3=/home/bamboo/apache-maven-3.3.9
bamboo_working_directory=/home/bamboo/bamboo-agent-home/xml-data/build-dir/BD-TC90-JOB1
bamboo_planKey=BD-TC90
bamboo_planRepository_1_repositoryUrl=ssh://git@opensource.ncsa.illinois.edu:7999/bd/tools-catalog.git
bamboo_planRepository_username=
bamboo_capability_system_jdk_JDK_1_8=/home/bamboo/jdk1.8.0_66
bamboo_capability_system_jdk_JDK_1_6=/home/bamboo/jdk1.6.0_41
bamboo_capability_system_builder_command_mkcrx=/home/bamboo/mkcrx/mkcrx.sh
bamboo_capability_system_jdk_JDK_1_7=/home/bamboo/jdk1.7.0_60
bamboo_planRepository_1_branchName=feature/BD-1801-spike-investigate-upgrading-tools
19-Oct-2017 08:56:08 Java HotSpot(TM) 64-Bit Server VM warning: ignoring option MaxPermSize=384M; support was removed in 8.0
19-Oct-2017 08:56:08 Getting org.scala-sbt sbt 1.0.2 ...
19-Oct-2017 08:56:31 downloading http://repo1.maven.org/maven2/org/scala-sbt/sbt/1.0.2/sbt-1.0.2.jar ...
19-Oct-2017 08:56:31         [SUCCESSFUL ] org.scala-sbt#sbt;1.0.2!sbt.jar (32ms)
19-Oct-2017 08:56:31 downloading http://repo1.maven.org/maven2/org/scala-lang/scala-library/2.12.3/scala-library-2.12.3.jar ...
19-Oct-2017 08:56:32         [SUCCESSFUL ] org.scala-lang#scala-library;2.12.3!scala-library.jar (445ms)
19-Oct-2017 08:56:32 downloading http://repo1.maven.org/maven2/org/scala-sbt/main_2.12/1.0.2/main_2.12-1.0.2.jar ...
19-Oct-2017 08:56:32         [SUCCESSFUL ] org.scala-sbt#main_2.12;1.0.2!main_2.12.jar (115ms)
19-Oct-2017 08:56:32 downloading http://repo1.maven.org/maven2/org/scala-sbt/logic_2.12/1.0.2/logic_2.12-1.0.2.jar ...
19-Oct-2017 08:56:32         [SUCCESSFUL ] org.scala-sbt#logic_2.12;1.0.2!logic_2.12.jar (20ms)
19-Oct-2017 08:56:32 downloading http://repo1.maven.org/maven2/org/scala-sbt/actions_2.12/1.0.2/actions_2.12-1.0.2.jar ...
19-Oct-2017 08:56:32         [SUCCESSFUL ] org.scala-sbt#actions_2.12;1.0.2!actions_2.12.jar (25ms)
19-Oct-2017 08:56:32 downloading http://repo1.maven.org/maven2/org/scala-sbt/main-settings_2.12/1.0.2/main-settings_2.12-1.0.2.jar ...
19-Oct-2017 08:56:32         [SUCCESSFUL ] org.scala-sbt#main-settings_2.12;1.0.2!main-settings_2.12.jar (49ms)
19-Oct-2017 08:56:32 downloading http://repo1.maven.org/maven2/org/scala-sbt/run_2.12/1.0.2/run_2.12-1.0.2.jar ...
19-Oct-2017 08:56:32         [SUCCESSFUL ] org.scala-sbt#run_2.12;1.0.2!run_2.12.jar (19ms)
19-Oct-2017 08:56:32 downloading http://repo1.maven.org/maven2/org/scala-sbt/command_2.12/1.0.2/command_2.12-1.0.2.jar ...
19-Oct-2017 08:56:32         [SUCCESSFUL ] org.scala-sbt#command_2.12;1.0.2!command_2.12.jar (35ms)
19-Oct-2017 08:56:32 downloading http://repo1.maven.org/maven2/org/scala-sbt/collections_2.12/1.0.2/collections_2.12-1.0.2.jar ...
19-Oct-2017 08:56:32         [SUCCESSFUL ] org.scala-sbt#collections_2.12;1.0.2!collections_2.12.jar (44ms)
19-Oct-2017 08:56:32 downloading http://repo1.maven.org/maven2/org/scala-lang/modules/scala-xml_2.12/1.0.6/scala-xml_2.12-1.0.6.jar ...
19-Oct-2017 08:56:32         [SUCCESSFUL ] org.scala-lang.modules#scala-xml_2.12;1.0.6!scala-xml_2.12.jar(bundle) (43ms)
19-Oct-2017 08:56:32 downloading http://repo1.maven.org/maven2/org/scala-sbt/launcher-interface/1.0.0/launcher-interface-1.0.0.jar ...
19-Oct-2017 08:56:32         [SUCCESSFUL ] org.scala-sbt#launcher-interface;1.0.0!launcher-interface.jar (18ms)
19-Oct-2017 08:56:32 downloading http://repo1.maven.org/maven2/org/apache/logging/log4j/log4j-api/2.8.1/log4j-api-2.8.1.jar ...
19-Oct-2017 08:56:32         [SUCCESSFUL ] org.apache.logging.log4j#log4j-api;2.8.1!log4j-api.jar (25ms)
19-Oct-2017 08:56:32 downloading http://repo1.maven.org/maven2/org/apache/logging/log4j/log4j-core/2.8.1/log4j-core-2.8.1.jar ...
19-Oct-2017 08:56:32         [SUCCESSFUL ] org.apache.logging.log4j#log4j-core;2.8.1!log4j-core.jar (88ms)
19-Oct-2017 08:56:32 downloading http://repo1.maven.org/maven2/org/apache/logging/log4j/log4j-slf4j-impl/2.8.1/log4j-slf4j-impl-2.8.1.jar ...
19-Oct-2017 08:56:32         [SUCCESSFUL ] org.apache.logging.log4j#log4j-slf4j-impl;2.8.1!log4j-slf4j-impl.jar (40ms)
19-Oct-2017 08:56:32 downloading http://repo1.maven.org/maven2/org/scala-sbt/io_2.12/1.0.1/io_2.12-1.0.1.jar ...
19-Oct-2017 08:56:32         [SUCCESSFUL ] org.scala-sbt#io_2.12;1.0.1!io_2.12.jar (24ms)
19-Oct-2017 08:56:32 downloading http://repo1.maven.org/maven2/org/scala-sbt/util-logging_2.12/1.0.1/util-logging_2.12-1.0.1.jar ...
19-Oct-2017 08:56:32         [SUCCESSFUL ] org.scala-sbt#util-logging_2.12;1.0.1!util-logging_2.12.jar (47ms)
19-Oct-2017 08:56:32 downloading http://repo1.maven.org/maven2/org/scala-sbt/librarymanagement-core_2.12/1.0.2/librarymanagement-core_2.12-1.0.2.jar ...
19-Oct-2017 08:56:33         [SUCCESSFUL ] org.scala-sbt#librarymanagement-core_2.12;1.0.2!librarymanagement-core_2.12.jar (52ms)
19-Oct-2017 08:56:33 downloading http://repo1.maven.org/maven2/org/scala-sbt/librarymanagement-ivy_2.12/1.0.2/librarymanagement-ivy_2.12-1.0.2.jar ...
19-Oct-2017 08:56:33         [SUCCESSFUL ] org.scala-sbt#librarymanagement-ivy_2.12;1.0.2!librarymanagement-ivy_2.12.jar (48ms)
19-Oct-2017 08:56:33 downloading http://repo1.maven.org/maven2/org/scala-sbt/compiler-interface/1.0.1/compiler-interface-1.0.1.jar ...
19-Oct-2017 08:56:33         [SUCCESSFUL ] org.scala-sbt#compiler-interface;1.0.1!compiler-interface.jar (20ms)
19-Oct-2017 08:56:33 downloading http://repo1.maven.org/maven2/org/scala-sbt/zinc-compile_2.12/1.0.1/zinc-compile_2.12-1.0.1.jar ...
19-Oct-2017 08:56:33         [SUCCESSFUL ] org.scala-sbt#zinc-compile_2.12;1.0.1!zinc-compile_2.12.jar (17ms)
19-Oct-2017 08:56:33 downloading http://repo1.maven.org/maven2/org/scala-sbt/util-relation_2.12/1.0.1/util-relation_2.12-1.0.1.jar ...
19-Oct-2017 08:56:33         [SUCCESSFUL ] org.scala-sbt#util-relation_2.12;1.0.1!util-relation_2.12.jar (17ms)
19-Oct-2017 08:56:33 downloading http://repo1.maven.org/maven2/com/eed3si9n/sjson-new-scalajson_2.12/0.8.0/sjson-new-scalajson_2.12-0.8.0.jar ...
19-Oct-2017 08:56:33         [SUCCESSFUL ] com.eed3si9n#sjson-new-scalajson_2.12;0.8.0!sjson-new-scalajson_2.12.jar (17ms)
19-Oct-2017 08:56:33 downloading http://repo1.maven.org/maven2/org/scala-sbt/util-position_2.12/1.0.1/util-position_2.12-1.0.1.jar ...
19-Oct-2017 08:56:33         [SUCCESSFUL ] org.scala-sbt#util-position_2.12;1.0.1!util-position_2.12.jar (17ms)
19-Oct-2017 08:56:33 downloading http://repo1.maven.org/maven2/com/eed3si9n/sjson-new-core_2.12/0.8.0/sjson-new-core_2.12-0.8.0.jar ...
19-Oct-2017 08:56:33         [SUCCESSFUL ] com.eed3si9n#sjson-new-core_2.12;0.8.0!sjson-new-core_2.12.jar (51ms)
19-Oct-2017 08:56:33 downloading http://repo1.maven.org/maven2/com/eed3si9n/shaded-scalajson_2.12/1.0.0-M4/shaded-scalajson_2.12-1.0.0-M4.jar ...
19-Oct-2017 08:56:33         [SUCCESSFUL ] com.eed3si9n#shaded-scalajson_2.12;1.0.0-M4!shaded-scalajson_2.12.jar (18ms)
19-Oct-2017 08:56:33 downloading http://repo1.maven.org/maven2/org/spire-math/jawn-parser_2.12/0.10.4/jawn-parser_2.12-0.10.4.jar ...
19-Oct-2017 08:56:33         [SUCCESSFUL ] org.spire-math#jawn-parser_2.12;0.10.4!jawn-parser_2.12.jar (19ms)
19-Oct-2017 08:56:33 downloading http://repo1.maven.org/maven2/org/scala-sbt/completion_2.12/1.0.2/completion_2.12-1.0.2.jar ...
19-Oct-2017 08:56:33         [SUCCESSFUL ] org.scala-sbt#completion_2.12;1.0.2!completion_2.12.jar (40ms)
19-Oct-2017 08:56:33 downloading http://repo1.maven.org/maven2/org/scala-sbt/task-system_2.12/1.0.2/task-system_2.12-1.0.2.jar ...
19-Oct-2017 08:56:33         [SUCCESSFUL ] org.scala-sbt#task-system_2.12;1.0.2!task-system_2.12.jar (20ms)
19-Oct-2017 08:56:33 downloading http://repo1.maven.org/maven2/org/scala-sbt/tasks_2.12/1.0.2/tasks_2.12-1.0.2.jar ...
19-Oct-2017 08:56:33         [SUCCESSFUL ] org.scala-sbt#tasks_2.12;1.0.2!tasks_2.12.jar (23ms)
19-Oct-2017 08:56:33 downloading http://repo1.maven.org/maven2/org/scala-sbt/testing_2.12/1.0.2/testing_2.12-1.0.2.jar ...
19-Oct-2017 08:56:33         [SUCCESSFUL ] org.scala-sbt#testing_2.12;1.0.2!testing_2.12.jar (24ms)
19-Oct-2017 08:56:33 downloading http://repo1.maven.org/maven2/org/scala-sbt/util-tracking_2.12/1.0.1/util-tracking_2.12-1.0.1.jar ...
19-Oct-2017 08:56:33         [SUCCESSFUL ] org.scala-sbt#util-tracking_2.12;1.0.1!util-tracking_2.12.jar (17ms)
19-Oct-2017 08:56:33 downloading http://repo1.maven.org/maven2/org/scala-sbt/zinc-classpath_2.12/1.0.1/zinc-classpath_2.12-1.0.1.jar ...
19-Oct-2017 08:56:33         [SUCCESSFUL ] org.scala-sbt#zinc-classpath_2.12;1.0.1!zinc-classpath_2.12.jar (19ms)
19-Oct-2017 08:56:33 downloading http://repo1.maven.org/maven2/org/scala-sbt/zinc-apiinfo_2.12/1.0.1/zinc-apiinfo_2.12-1.0.1.jar ...
19-Oct-2017 08:56:33         [SUCCESSFUL ] org.scala-sbt#zinc-apiinfo_2.12;1.0.1!zinc-apiinfo_2.12.jar (23ms)
19-Oct-2017 08:56:33 downloading http://repo1.maven.org/maven2/org/scala-sbt/zinc-ivy-integration_2.12/1.0.1/zinc-ivy-integration_2.12-1.0.1.jar ...
19-Oct-2017 08:56:33         [SUCCESSFUL ] org.scala-sbt#zinc-ivy-integration_2.12;1.0.1!zinc-ivy-integration_2.12.jar (17ms)
19-Oct-2017 08:56:33 downloading http://repo1.maven.org/maven2/org/scala-sbt/zinc_2.12/1.0.1/zinc_2.12-1.0.1.jar ...
19-Oct-2017 08:56:33         [SUCCESSFUL ] org.scala-sbt#zinc_2.12;1.0.1!zinc_2.12.jar (18ms)
19-Oct-2017 08:56:33 downloading http://repo1.maven.org/maven2/org/scala-sbt/util-control_2.12/1.0.1/util-control_2.12-1.0.1.jar ...
19-Oct-2017 08:56:33         [SUCCESSFUL ] org.scala-sbt#util-control_2.12;1.0.1!util-control_2.12.jar (16ms)
19-Oct-2017 08:56:33 downloading http://repo1.maven.org/maven2/org/scala-sbt/util-interface/1.0.1/util-interface-1.0.1.jar ...
19-Oct-2017 08:56:33         [SUCCESSFUL ] org.scala-sbt#util-interface;1.0.1!util-interface.jar (17ms)
19-Oct-2017 08:56:33 downloading http://repo1.maven.org/maven2/com/lmax/disruptor/3.3.6/disruptor-3.3.6.jar ...
19-Oct-2017 08:56:33         [SUCCESSFUL ] com.lmax#disruptor;3.3.6!disruptor.jar (18ms)
19-Oct-2017 08:56:33 downloading http://repo1.maven.org/maven2/org/scala-lang/scala-reflect/2.12.3/scala-reflect-2.12.3.jar ...
19-Oct-2017 08:56:33         [SUCCESSFUL ] org.scala-lang#scala-reflect;2.12.3!scala-reflect.jar (162ms)
19-Oct-2017 08:56:33 downloading http://repo1.maven.org/maven2/org/scala-lang/scala-compiler/2.12.3/scala-compiler-2.12.3.jar ...
19-Oct-2017 08:56:34         [SUCCESSFUL ] org.scala-lang#scala-compiler;2.12.3!scala-compiler.jar (350ms)
19-Oct-2017 08:56:34 downloading http://repo1.maven.org/maven2/org/scala-sbt/util-cache_2.12/1.0.1/util-cache_2.12-1.0.1.jar ...
19-Oct-2017 08:56:34         [SUCCESSFUL ] org.scala-sbt#util-cache_2.12;1.0.1!util-cache_2.12.jar (24ms)
19-Oct-2017 08:56:34 downloading http://repo1.maven.org/maven2/com/eed3si9n/sjson-new-murmurhash_2.12/0.8.0/sjson-new-murmurhash_2.12-0.8.0.jar ...
19-Oct-2017 08:56:34         [SUCCESSFUL ] com.eed3si9n#sjson-new-murmurhash_2.12;0.8.0!sjson-new-murmurhash_2.12.jar (17ms)
19-Oct-2017 08:56:34 downloading http://repo1.maven.org/maven2/org/scala-sbt/test-agent/1.0.2/test-agent-1.0.2.jar ...
19-Oct-2017 08:56:34         [SUCCESSFUL ] org.scala-sbt#test-agent;1.0.2!test-agent.jar (16ms)
19-Oct-2017 08:56:34 downloading http://repo1.maven.org/maven2/org/scala-sbt/zinc-classfile_2.12/1.0.1/zinc-classfile_2.12-1.0.1.jar ...
19-Oct-2017 08:56:34         [SUCCESSFUL ] org.scala-sbt#zinc-classfile_2.12;1.0.1!zinc-classfile_2.12.jar (17ms)
19-Oct-2017 08:56:34 downloading http://repo1.maven.org/maven2/com/eed3si9n/gigahorse-okhttp_2.12/0.3.0/gigahorse-okhttp_2.12-0.3.0.jar ...
19-Oct-2017 08:56:34         [SUCCESSFUL ] com.eed3si9n#gigahorse-okhttp_2.12;0.3.0!gigahorse-okhttp_2.12.jar (17ms)
19-Oct-2017 08:56:34 downloading http://repo1.maven.org/maven2/com/squareup/okhttp3/okhttp-urlconnection/3.7.0/okhttp-urlconnection-3.7.0.jar ...
19-Oct-2017 08:56:34         [SUCCESSFUL ] com.squareup.okhttp3#okhttp-urlconnection;3.7.0!okhttp-urlconnection.jar (44ms)
19-Oct-2017 08:56:34 downloading http://repo1.maven.org/maven2/com/eed3si9n/gigahorse-core_2.12/0.3.0/gigahorse-core_2.12-0.3.0.jar ...
19-Oct-2017 08:56:34         [SUCCESSFUL ] com.eed3si9n#gigahorse-core_2.12;0.3.0!gigahorse-core_2.12.jar (21ms)
19-Oct-2017 08:56:34 downloading http://repo1.maven.org/maven2/com/squareup/okhttp3/okhttp/3.7.0/okhttp-3.7.0.jar ...
19-Oct-2017 08:56:34         [SUCCESSFUL ] com.squareup.okhttp3#okhttp;3.7.0!okhttp.jar (26ms)
19-Oct-2017 08:56:34 downloading http://repo1.maven.org/maven2/com/typesafe/ssl-config-core_2.12/0.2.2/ssl-config-core_2.12-0.2.2.jar ...
19-Oct-2017 08:56:34         [SUCCESSFUL ] com.typesafe#ssl-config-core_2.12;0.2.2!ssl-config-core_2.12.jar(bundle) (23ms)
19-Oct-2017 08:56:34 downloading http://repo1.maven.org/maven2/org/slf4j/slf4j-api/1.7.25/slf4j-api-1.7.25.jar ...
19-Oct-2017 08:56:34         [SUCCESSFUL ] org.slf4j#slf4j-api;1.7.25!slf4j-api.jar (17ms)
19-Oct-2017 08:56:34 downloading http://repo1.maven.org/maven2/com/typesafe/config/1.2.0/config-1.2.0.jar ...
19-Oct-2017 08:56:34         [SUCCESSFUL ] com.typesafe#config;1.2.0!config.jar(bundle) (23ms)
19-Oct-2017 08:56:34 downloading http://repo1.maven.org/maven2/com/squareup/okio/okio/1.12.0/okio-1.12.0.jar ...
19-Oct-2017 08:56:34         [SUCCESSFUL ] com.squareup.okio#okio;1.12.0!okio.jar (17ms)
19-Oct-2017 08:56:34 downloading http://repo1.maven.org/maven2/org/scala-sbt/zinc-compile-core_2.12/1.0.1/zinc-compile-core_2.12-1.0.1.jar ...
19-Oct-2017 08:56:34         [SUCCESSFUL ] org.scala-sbt#zinc-compile-core_2.12;1.0.1!zinc-compile-core_2.12.jar (22ms)
19-Oct-2017 08:56:34 downloading http://repo1.maven.org/maven2/org/scala-lang/modules/scala-parser-combinators_2.12/1.0.5/scala-parser-combinators_2.12-1.0.5.jar ...
19-Oct-2017 08:56:34         [SUCCESSFUL ] org.scala-lang.modules#scala-parser-combinators_2.12;1.0.5!scala-parser-combinators_2.12.jar(bundle) (21ms)
19-Oct-2017 08:56:34 downloading http://repo1.maven.org/maven2/org/scala-sbt/zinc-core_2.12/1.0.1/zinc-core_2.12-1.0.1.jar ...
19-Oct-2017 08:56:34         [SUCCESSFUL ] org.scala-sbt#zinc-core_2.12;1.0.1!zinc-core_2.12.jar (26ms)
19-Oct-2017 08:56:34 downloading http://repo1.maven.org/maven2/org/scala-sbt/zinc-persist_2.12/1.0.1/zinc-persist_2.12-1.0.1.jar ...
19-Oct-2017 08:56:34         [SUCCESSFUL ] org.scala-sbt#zinc-persist_2.12;1.0.1!zinc-persist_2.12.jar (70ms)
19-Oct-2017 08:56:34 downloading http://repo1.maven.org/maven2/com/trueaccord/scalapb/scalapb-runtime_2.12/0.6.0/scalapb-runtime_2.12-0.6.0.jar ...
19-Oct-2017 08:56:34         [SUCCESSFUL ] com.trueaccord.scalapb#scalapb-runtime_2.12;0.6.0!scalapb-runtime_2.12.jar (68ms)
19-Oct-2017 08:56:34 downloading http://repo1.maven.org/maven2/org/scala-sbt/sbinary_2.12/0.4.4/sbinary_2.12-0.4.4.jar ...
19-Oct-2017 08:56:34         [SUCCESSFUL ] org.scala-sbt#sbinary_2.12;0.4.4!sbinary_2.12.jar (20ms)
19-Oct-2017 08:56:34 downloading http://repo1.maven.org/maven2/com/trueaccord/lenses/lenses_2.12/0.4.12/lenses_2.12-0.4.12.jar ...
19-Oct-2017 08:56:34         [SUCCESSFUL ] com.trueaccord.lenses#lenses_2.12;0.4.12!lenses_2.12.jar (17ms)
19-Oct-2017 08:56:34 downloading http://repo1.maven.org/maven2/com/lihaoyi/fastparse_2.12/0.4.2/fastparse_2.12-0.4.2.jar ...
19-Oct-2017 08:56:34         [SUCCESSFUL ] com.lihaoyi#fastparse_2.12;0.4.2!fastparse_2.12.jar (23ms)
19-Oct-2017 08:56:34 downloading http://repo1.maven.org/maven2/com/google/protobuf/protobuf-java/3.3.1/protobuf-java-3.3.1.jar ...
19-Oct-2017 08:56:34         [SUCCESSFUL ] com.google.protobuf#protobuf-java;3.3.1!protobuf-java.jar(bundle) (55ms)
19-Oct-2017 08:56:34 downloading http://repo1.maven.org/maven2/com/lihaoyi/fastparse-utils_2.12/0.4.2/fastparse-utils_2.12-0.4.2.jar ...
19-Oct-2017 08:56:34         [SUCCESSFUL ] com.lihaoyi#fastparse-utils_2.12;0.4.2!fastparse-utils_2.12.jar (22ms)
19-Oct-2017 08:56:34 downloading http://repo1.maven.org/maven2/com/lihaoyi/sourcecode_2.12/0.1.3/sourcecode_2.12-0.1.3.jar ...
19-Oct-2017 08:56:34         [SUCCESSFUL ] com.lihaoyi#sourcecode_2.12;0.1.3!sourcecode_2.12.jar (17ms)
19-Oct-2017 08:56:34 downloading http://repo1.maven.org/maven2/org/scala-sbt/core-macros_2.12/1.0.2/core-macros_2.12-1.0.2.jar ...
19-Oct-2017 08:56:34         [SUCCESSFUL ] org.scala-sbt#core-macros_2.12;1.0.2!core-macros_2.12.jar (17ms)
19-Oct-2017 08:56:34 downloading http://repo1.maven.org/maven2/org/scala-sbt/protocol_2.12/1.0.2/protocol_2.12-1.0.2.jar ...
19-Oct-2017 08:56:34         [SUCCESSFUL ] org.scala-sbt#protocol_2.12;1.0.2!protocol_2.12.jar (18ms)
19-Oct-2017 08:56:34 downloading http://repo1.maven.org/maven2/org/scala-sbt/ivy/ivy/2.3.0-sbt-a3314352b638afbf0dca19f127e8263ed6f898bd/ivy-2.3.0-sbt-a3314352b638afbf0dca19f127e8263ed6f898bd.jar ...
19-Oct-2017 08:56:34         [SUCCESSFUL ] org.scala-sbt.ivy#ivy;2.3.0-sbt-a3314352b638afbf0dca19f127e8263ed6f898bd!ivy.jar (48ms)
19-Oct-2017 08:56:34 :: retrieving :: org.scala-sbt#boot-app
19-Oct-2017 08:56:34         confs: [default]
19-Oct-2017 08:56:34         69 artifacts copied, 0 already retrieved (22000kB/132ms)
19-Oct-2017 08:56:34 Getting Scala 2.12.3 (for sbt)...
19-Oct-2017 08:56:34 :: retrieving :: org.scala-sbt#boot-scala
19-Oct-2017 08:56:34         confs: [default]
19-Oct-2017 08:56:34         5 artifacts copied, 0 already retrieved (19004kB/21ms)
19-Oct-2017 08:56:40 [info] Loading settings from plugins.sbt ...
19-Oct-2017 08:56:40 [info] Loading project definition from /home/bamboo/bamboo-agent-home/xml-data/build-dir/BD-TC90-JOB1/project
19-Oct-2017 08:56:40 [info] Updating {file:/home/bamboo/bamboo-agent-home/xml-data/build-dir/BD-TC90-JOB1/project/}bd-tc90-job1-build...
19-Oct-2017 08:57:51 [info] downloading https://repo1.maven.org/maven2/org/glassfish/jersey/core/jersey-common/2.19/jersey-common-2.19.jar ...
19-Oct-2017 08:57:51 [info] downloading https://repo1.maven.org/maven2/com/typesafe/akka/akka-actor_2.12/2.5.4/akka-actor_2.12-2.5.4.jar ...
19-Oct-2017 08:57:51 [info] downloading https://repo1.maven.org/maven2/io/aeron/aeron-driver/1.2.5/aeron-driver-1.2.5.jar ...
19-Oct-2017 08:57:52 [info] downloading https://repo.scala-sbt.org/scalasbt/sbt-plugin-releases/com.typesafe.play/sbt-plugin/scala_2.12/sbt_1.0//2.6.6/jars/sbt-plugin.jar ...
19-Oct-2017 08:57:52 [info]         [SUCCESSFUL ] io.aeron#aeron-driver;1.2.5!aeron-driver.jar (105ms)
19-Oct-2017 08:57:52 [info] downloading https://repo1.maven.org/maven2/io/aeron/aeron-client/1.2.5/aeron-client-1.2.5.jar ...
19-Oct-2017 08:57:52 [info]         [SUCCESSFUL ] io.aeron#aeron-client;1.2.5!aeron-client.jar (31ms)
19-Oct-2017 08:57:52 [info] downloading https://repo1.maven.org/maven2/org/reactivestreams/reactive-streams/1.0.1/reactive-streams-1.0.1.jar ...
19-Oct-2017 08:57:52 [info]         [SUCCESSFUL ] org.glassfish.jersey.core#jersey-common;2.19!jersey-common.jar (199ms)
19-Oct-2017 08:57:52 [info] downloading https://repo1.maven.org/maven2/org/glassfish/hk2/hk2-api/2.4.0-b25/hk2-api-2.4.0-b25.jar ...
19-Oct-2017 08:57:52 [info]         [SUCCESSFUL ] org.reactivestreams#reactive-streams;1.0.1!reactive-streams.jar (24ms)
19-Oct-2017 08:57:52 [info] downloading https://repo1.maven.org/maven2/com/typesafe/ssl-config-core_2.12/0.2.1/ssl-config-core_2.12-0.2.1.jar ...
19-Oct-2017 08:57:52 [info]         [SUCCESSFUL ] org.glassfish.hk2#hk2-api;2.4.0-b25!hk2-api.jar (36ms)
19-Oct-2017 08:57:52 [info] downloading https://repo1.maven.org/maven2/org/glassfish/hk2/external/javax.inject/2.4.0-b25/javax.inject-2.4.0-b25.jar ...
19-Oct-2017 08:57:52 [info]         [SUCCESSFUL ] org.glassfish.hk2.external#javax.inject;2.4.0-b25!javax.inject.jar (19ms)
19-Oct-2017 08:57:52 [info]         [SUCCESSFUL ] com.typesafe#ssl-config-core_2.12;0.2.1!ssl-config-core_2.12.jar(bundle) (48ms)
19-Oct-2017 08:57:52 [info] downloading https://repo1.maven.org/maven2/org/glassfish/hk2/hk2-locator/2.4.0-b25/hk2-locator-2.4.0-b25.jar ...
19-Oct-2017 08:57:52 [info] downloading https://repo1.maven.org/maven2/org/agrona/agrona/0.9.5/agrona-0.9.5.jar ...
19-Oct-2017 08:57:52 [info]         [SUCCESSFUL ] org.glassfish.hk2#hk2-locator;2.4.0-b25!hk2-locator.jar (39ms)
19-Oct-2017 08:57:52 [info] downloading https://repo1.maven.org/maven2/javax/annotation/javax.annotation-api/1.2/javax.annotation-api-1.2.jar ...
19-Oct-2017 08:57:52 [info]         [SUCCESSFUL ] org.agrona#agrona;0.9.5!agrona.jar (46ms)
19-Oct-2017 08:57:52 [info] downloading https://repo1.maven.org/maven2/io/apigee/trireme/trireme-kernel/0.8.9/trireme-kernel-0.8.9.jar ...
19-Oct-2017 08:57:52 [info]         [SUCCESSFUL ] javax.annotation#javax.annotation-api;1.2!javax.annotation-api.jar (35ms)
19-Oct-2017 08:57:52 [info] downloading https://repo1.maven.org/maven2/org/glassfish/jersey/bundles/repackaged/jersey-guava/2.19/jersey-guava-2.19.jar ...
19-Oct-2017 08:57:52 [info]         [SUCCESSFUL ] com.typesafe.akka#akka-actor_2.12;2.5.4!akka-actor_2.12.jar (308ms)
19-Oct-2017 08:57:52 [info] downloading https://repo1.maven.org/maven2/org/webjars/webjars-locator-core/0.32/webjars-locator-core-0.32.jar ...
19-Oct-2017 08:57:52 [info]         [SUCCESSFUL ] io.apigee.trireme#trireme-kernel;0.8.9!trireme-kernel.jar (65ms)
19-Oct-2017 08:57:52 [info]         [SUCCESSFUL ] org.webjars#webjars-locator-core;0.32!webjars-locator-core.jar (25ms)
19-Oct-2017 08:57:52 [info] downloading https://repo1.maven.org/maven2/org/scala-lang/modules/scala-java8-compat_2.12/0.8.0/scala-java8-compat_2.12-0.8.0.jar ...
19-Oct-2017 08:57:52 [info] downloading https://repo1.maven.org/maven2/org/mozilla/rhino/1.7.7.1/rhino-1.7.7.1.jar ...
19-Oct-2017 08:57:52 [info]         [SUCCESSFUL ] org.glassfish.jersey.bundles.repackaged#jersey-guava;2.19!jersey-guava.jar(bundle) (119ms)
19-Oct-2017 08:57:52 [info] downloading https://repo1.maven.org/maven2/org/glassfish/hk2/osgi-resource-locator/1.0.1/osgi-resource-locator-1.0.1.jar ...
19-Oct-2017 08:57:52 [info]         [SUCCESSFUL ] org.scala-lang.modules#scala-java8-compat_2.12;0.8.0!scala-java8-compat_2.12.jar(bundle) (92ms)
19-Oct-2017 08:57:52 [info] downloading https://repo1.maven.org/maven2/com/typesafe/jse_2.12/1.2.3/jse_2.12-1.2.3.jar ...
19-Oct-2017 08:57:52 [info]         [SUCCESSFUL ] org.glassfish.hk2#osgi-resource-locator;1.0.1!osgi-resource-locator.jar (21ms)
19-Oct-2017 08:57:52 [info] downloading https://repo1.maven.org/maven2/org/glassfish/hk2/hk2-utils/2.4.0-b25/hk2-utils-2.4.0-b25.jar ...
19-Oct-2017 08:57:52 [info]         [SUCCESSFUL ] com.typesafe#jse_2.12;1.2.3!jse_2.12.jar (31ms)
19-Oct-2017 08:57:52 [info] downloading https://repo1.maven.org/maven2/com/typesafe/npm_2.12/1.2.1/npm_2.12-1.2.1.jar ...
19-Oct-2017 08:57:52 [info]         [SUCCESSFUL ] org.glassfish.hk2#hk2-utils;2.4.0-b25!hk2-utils.jar (27ms)
19-Oct-2017 08:57:52 [info] downloading https://repo1.maven.org/maven2/org/glassfish/hk2/external/aopalliance-repackaged/2.4.0-b25/aopalliance-repackaged-2.4.0-b25.jar ...
19-Oct-2017 08:57:52 [info]         [SUCCESSFUL ] org.mozilla#rhino;1.7.7.1!rhino.jar (124ms)
19-Oct-2017 08:57:52 [info] downloading https://repo1.maven.org/maven2/org/webjars/npm/4.2.0/npm-4.2.0.jar ...
19-Oct-2017 08:57:52 [info]         [SUCCESSFUL ] com.typesafe#npm_2.12;1.2.1!npm_2.12.jar (21ms)
19-Oct-2017 08:57:52 [info] downloading https://repo1.maven.org/maven2/com/typesafe/akka/akka-contrib_2.12/2.5.4/akka-contrib_2.12-2.5.4.jar ...
19-Oct-2017 08:57:52 [info]         [SUCCESSFUL ] org.glassfish.hk2.external#aopalliance-repackaged;2.4.0-b25!aopalliance-repackaged.jar (23ms)
19-Oct-2017 08:57:52 [info] downloading https://repo1.maven.org/maven2/org/javassist/javassist/3.18.1-GA/javassist-3.18.1-GA.jar ...
19-Oct-2017 08:57:52 [info]         [SUCCESSFUL ] com.typesafe.akka#akka-contrib_2.12;2.5.4!akka-contrib_2.12.jar (34ms)
19-Oct-2017 08:57:52 [info] downloading https://repo1.maven.org/maven2/io/apigee/trireme/trireme-core/0.8.9/trireme-core-0.8.9.jar ...
19-Oct-2017 08:57:52 [info]         [SUCCESSFUL ] io.apigee.trireme#trireme-core;0.8.9!trireme-core.jar (33ms)
19-Oct-2017 08:57:52 [info] downloading https://repo1.maven.org/maven2/io/apigee/trireme/trireme-node10src/0.8.9/trireme-node10src-0.8.9.jar ...
19-Oct-2017 08:57:52 [info]         [SUCCESSFUL ] org.javassist#javassist;3.18.1-GA!javassist.jar(bundle) (75ms)
19-Oct-2017 08:57:52 [info] downloading https://repo1.maven.org/maven2/org/glassfish/jersey/ext/jersey-entity-filtering/2.19/jersey-entity-filtering-2.19.jar ...
19-Oct-2017 08:57:52 [info]         [SUCCESSFUL ] org.glassfish.jersey.ext#jersey-entity-filtering;2.19!jersey-entity-filtering.jar (24ms)
19-Oct-2017 08:57:52 [info] downloading https://repo1.maven.org/maven2/org/apache/httpcomponents/httpcore/4.4.1/httpcore-4.4.1.jar ...
19-Oct-2017 08:57:52 [info]         [SUCCESSFUL ] org.apache.httpcomponents#httpcore;4.4.1!httpcore.jar (46ms)
19-Oct-2017 08:57:52 [info] downloading https://repo1.maven.org/maven2/com/github/jnr/jnr-ffi/2.0.3/jnr-ffi-2.0.3.jar ...
19-Oct-2017 08:57:52 [info]         [SUCCESSFUL ] io.apigee.trireme#trireme-node10src;0.8.9!trireme-node10src.jar (85ms)
19-Oct-2017 08:57:52 [info] downloading https://repo1.maven.org/maven2/io/spray/spray-json_2.12/1.3.3/spray-json_2.12-1.3.3.jar ...
19-Oct-2017 08:57:52 [info]         [SUCCESSFUL ] com.github.jnr#jnr-ffi;2.0.3!jnr-ffi.jar (53ms)
19-Oct-2017 08:57:52 [info] downloading https://repo1.maven.org/maven2/com/github/jnr/jnr-constants/0.8.7/jnr-constants-0.8.7.jar ...
19-Oct-2017 08:57:52 [info]         [SUCCESSFUL ] io.spray#spray-json_2.12;1.3.3!spray-json_2.12.jar(bundle) (71ms)
19-Oct-2017 08:57:52 [info] downloading https://repo1.maven.org/maven2/com/typesafe/akka/akka-remote_2.12/2.5.4/akka-remote_2.12-2.5.4.jar ...
19-Oct-2017 08:57:52 [info]         [SUCCESSFUL ] org.webjars#npm;4.2.0!npm.jar (245ms)
19-Oct-2017 08:57:52 [info]         [SUCCESSFUL ] com.github.jnr#jnr-constants;0.8.7!jnr-constants.jar (37ms)
19-Oct-2017 08:57:52 [info] downloading https://repo1.maven.org/maven2/com/github/jnr/jnr-enxio/0.9/jnr-enxio-0.9.jar ...
19-Oct-2017 08:57:52 [info]         [SUCCESSFUL ] com.github.jnr#jnr-enxio;0.9!jnr-enxio.jar (21ms)
19-Oct-2017 08:57:52 [info] downloading https://repo1.maven.org/maven2/com/github/jnr/jnr-posix/3.0.12/jnr-posix-3.0.12.jar ...
19-Oct-2017 08:57:52 [info]         [SUCCESSFUL ] com.typesafe.play#sbt-plugin;2.6.6!sbt-plugin.jar (791ms)
19-Oct-2017 08:57:52 [info] downloading https://repo1.maven.org/maven2/com/typesafe/play/sbt-routes-compiler_2.12/2.6.6/sbt-routes-compiler_2.12-2.6.6.jar ...
19-Oct-2017 08:57:52 [info]         [SUCCESSFUL ] com.github.jnr#jnr-posix;3.0.12!jnr-posix.jar (31ms)
19-Oct-2017 08:57:52 [info] downloading https://repo1.maven.org/maven2/com/github/jnr/jffi/1.2.9/jffi-1.2.9.jar ...
19-Oct-2017 08:57:52 [info]         [SUCCESSFUL ] com.typesafe.play#sbt-routes-compiler_2.12;2.6.6!sbt-routes-compiler_2.12.jar (31ms)
19-Oct-2017 08:57:52 [info] downloading https://repo1.maven.org/maven2/com/typesafe/play/run-support_2.12/2.6.6/run-support_2.12-2.6.6.jar ...
19-Oct-2017 08:57:52 [info]         [SUCCESSFUL ] com.github.jnr#jffi;1.2.9!jffi.jar (27ms)
19-Oct-2017 08:57:52 [info]         [SUCCESSFUL ] com.typesafe.play#run-support_2.12;2.6.6!run-support_2.12.jar (26ms)
19-Oct-2017 08:57:52 [info] downloading https://repo1.maven.org/maven2/com/typesafe/config/1.3.1/config-1.3.1.jar ...
19-Oct-2017 08:57:52 [info] downloading https://repo1.maven.org/maven2/com/github/jnr/jffi/1.2.9/jffi-1.2.9-native.jar ...
19-Oct-2017 08:57:52 [info]         [SUCCESSFUL ] com.typesafe#config;1.3.1!config.jar(bundle) (33ms)
19-Oct-2017 08:57:52 [info] downloading https://repo1.maven.org/maven2/org/slf4j/slf4j-simple/1.7.25/slf4j-simple-1.7.25.jar ...
19-Oct-2017 08:57:52 [info]         [SUCCESSFUL ] com.github.jnr#jffi;1.2.9!jffi.jar (72ms)
19-Oct-2017 08:57:52 [info] downloading https://repo1.maven.org/maven2/org/ow2/asm/asm/5.0.3/asm-5.0.3.jar ...
19-Oct-2017 08:57:52 [info]         [SUCCESSFUL ] org.slf4j#slf4j-simple;1.7.25!slf4j-simple.jar (44ms)
19-Oct-2017 08:57:52 [info] downloading https://repo1.maven.org/maven2/com/lightbend/play/play-file-watch_2.12/1.1.2/play-file-watch_2.12-1.1.2.jar ...
19-Oct-2017 08:57:52 [info]         [SUCCESSFUL ] org.ow2.asm#asm;5.0.3!asm.jar (24ms)
19-Oct-2017 08:57:52 [info] downloading https://repo1.maven.org/maven2/org/ow2/asm/asm-commons/5.0.3/asm-commons-5.0.3.jar ...
19-Oct-2017 08:57:52 [info]         [SUCCESSFUL ] com.typesafe.akka#akka-remote_2.12;2.5.4!akka-remote_2.12.jar (199ms)
19-Oct-2017 08:57:52 [info] downloading https://repo1.maven.org/maven2/com/typesafe/akka/akka-cluster_2.12/2.5.4/akka-cluster_2.12-2.5.4.jar ...
19-Oct-2017 08:57:52 [info]         [SUCCESSFUL ] com.lightbend.play#play-file-watch_2.12;1.1.2!play-file-watch_2.12.jar (24ms)
19-Oct-2017 08:57:52 [info]         [SUCCESSFUL ] org.ow2.asm#asm-commons;5.0.3!asm-commons.jar (21ms)
19-Oct-2017 08:57:52 [info] downloading https://repo1.maven.org/maven2/org/ow2/asm/asm-analysis/5.0.3/asm-analysis-5.0.3.jar ...
19-Oct-2017 08:57:52 [info]         [SUCCESSFUL ] org.ow2.asm#asm-analysis;5.0.3!asm-analysis.jar (19ms)
19-Oct-2017 08:57:52 [info] downloading https://repo1.maven.org/maven2/org/ow2/asm/asm-tree/5.0.3/asm-tree-5.0.3.jar ...
19-Oct-2017 08:57:52 [info]         [SUCCESSFUL ] org.ow2.asm#asm-tree;5.0.3!asm-tree.jar (20ms)
19-Oct-2017 08:57:52 [info] downloading https://repo1.maven.org/maven2/org/ow2/asm/asm-util/5.0.3/asm-util-5.0.3.jar ...
19-Oct-2017 08:57:52 [info]         [SUCCESSFUL ] com.typesafe.akka#akka-cluster_2.12;2.5.4!akka-cluster_2.12.jar (61ms)
19-Oct-2017 08:57:52 [info] downloading https://repo1.maven.org/maven2/com/typesafe/akka/akka-cluster-tools_2.12/2.5.4/akka-cluster-tools_2.12-2.5.4.jar ...
19-Oct-2017 08:57:52 [info]         [SUCCESSFUL ] org.ow2.asm#asm-util;5.0.3!asm-util.jar (34ms)
19-Oct-2017 08:57:52 [info] downloading https://repo1.maven.org/maven2/com/github/jnr/jnr-x86asm/1.0.2/jnr-x86asm-1.0.2.jar ...
19-Oct-2017 08:57:52 [info]         [SUCCESSFUL ] com.typesafe.akka#akka-cluster-tools_2.12;2.5.4!akka-cluster-tools_2.12.jar (59ms)
19-Oct-2017 08:57:52 [info] downloading https://repo1.maven.org/maven2/com/typesafe/akka/akka-persistence_2.12/2.5.4/akka-persistence_2.12-2.5.4.jar ...
19-Oct-2017 08:57:52 [info]         [SUCCESSFUL ] com.github.jnr#jnr-x86asm;1.0.2!jnr-x86asm.jar (31ms)
19-Oct-2017 08:57:52 [info] downloading https://repo1.maven.org/maven2/org/bouncycastle/bcprov-jdk15on/1.52/bcprov-jdk15on-1.52.jar ...
19-Oct-2017 08:57:52 [info] downloading https://repo1.maven.org/maven2/org/apache/logging/log4j/log4j-core/2.8.1/log4j-core-2.8.1-tests.jar ...
19-Oct-2017 08:57:53 [info]         [SUCCESSFUL ] com.typesafe.akka#akka-persistence_2.12;2.5.4!akka-persistence_2.12.jar (84ms)
19-Oct-2017 08:57:53 [info] downloading https://repo1.maven.org/maven2/com/typesafe/akka/akka-stream_2.12/2.5.4/akka-stream_2.12-2.5.4.jar ...
19-Oct-2017 08:57:53 [info]         [SUCCESSFUL ] org.apache.logging.log4j#log4j-core;2.8.1!log4j-core.jar(test-jar) (96ms)
19-Oct-2017 08:57:53 [info] downloading https://repo1.maven.org/maven2/com/typesafe/play/twirl-parser_2.12/1.3.12/twirl-parser_2.12-1.3.12.jar ...
19-Oct-2017 08:57:53 [info]         [SUCCESSFUL ] org.bouncycastle#bcprov-jdk15on;1.52!bcprov-jdk15on.jar (150ms)
19-Oct-2017 08:57:53 [info]         [SUCCESSFUL ] com.typesafe.play#twirl-parser_2.12;1.3.12!twirl-parser_2.12.jar (25ms)
19-Oct-2017 08:57:53 [info] downloading https://repo1.maven.org/maven2/org/apache/commons/commons-compress/1.14/commons-compress-1.14.jar ...
19-Oct-2017 08:57:53 [info] downloading https://repo1.maven.org/maven2/org/scala-lang/modules/scala-parser-combinators_2.12/1.0.6/scala-parser-combinators_2.12-1.0.6.jar ...
19-Oct-2017 08:57:53 [info]         [SUCCESSFUL ] org.apache.commons#commons-compress;1.14!commons-compress.jar (46ms)
19-Oct-2017 08:57:53 [info] downloading https://repo1.maven.org/maven2/org/apache/ant/ant/1.10.1/ant-1.10.1.jar ...
19-Oct-2017 08:57:53 [info]         [SUCCESSFUL ] org.scala-lang.modules#scala-parser-combinators_2.12;1.0.6!scala-parser-combinators_2.12.jar(bundle) (32ms)
19-Oct-2017 08:57:53 [info] downloading https://repo1.maven.org/maven2/com/typesafe/play/build-link/2.6.6/build-link-2.6.6.jar ...
19-Oct-2017 08:57:53 [info]         [SUCCESSFUL ] com.typesafe.play#build-link;2.6.6!build-link.jar (21ms)
19-Oct-2017 08:57:53 [info] downloading https://repo1.maven.org/maven2/com/typesafe/play/play-exceptions/2.6.6/play-exceptions-2.6.6.jar ...
19-Oct-2017 08:57:53 [info]         [SUCCESSFUL ] com.typesafe.play#play-exceptions;2.6.6!play-exceptions.jar (20ms)
19-Oct-2017 08:57:53 [info] downloading https://repo1.maven.org/maven2/io/methvin/directory-watcher/0.1.3/directory-watcher-0.1.3.jar ...
19-Oct-2017 08:57:53 [info] downloading https://repo.scala-sbt.org/scalasbt/sbt-plugin-releases/com.typesafe.sbt/sbt-twirl/scala_2.12/sbt_1.0//1.3.12/jars/sbt-twirl.jar ...
19-Oct-2017 08:57:53 [info]         [SUCCESSFUL ] io.methvin#directory-watcher;0.1.3!directory-watcher.jar (28ms)
19-Oct-2017 08:57:53 [info] downloading https://repo1.maven.org/maven2/com/github/pathikrit/better-files_2.12/2.17.1/better-files_2.12-2.17.1.jar ...
19-Oct-2017 08:57:53 [info]         [SUCCESSFUL ] com.github.pathikrit#better-files_2.12;2.17.1!better-files_2.12.jar (27ms)
19-Oct-2017 08:57:53 [info] downloading https://repo1.maven.org/maven2/net/java/dev/jna/jna/4.2.1/jna-4.2.1.jar ...
19-Oct-2017 08:57:53 [info]         [SUCCESSFUL ] org.apache.ant#ant;1.10.1!ant.jar (113ms)
19-Oct-2017 08:57:53 [info] downloading https://repo1.maven.org/maven2/org/scala-sbt/io_2.12/1.0.0/io_2.12-1.0.0.jar ...
19-Oct-2017 08:57:53 [info]         [SUCCESSFUL ] org.scala-sbt#io_2.12;1.0.0!io_2.12.jar (29ms)
19-Oct-2017 08:57:53 [info]         [SUCCESSFUL ] com.typesafe.akka#akka-stream_2.12;2.5.4!akka-stream_2.12.jar (261ms)
19-Oct-2017 08:57:53 [info] downloading https://repo1.maven.org/maven2/com/spotify/docker-client/3.5.13/docker-client-3.5.13.jar ...
19-Oct-2017 08:57:53 [info] downloading https://repo1.maven.org/maven2/com/typesafe/akka/akka-protobuf_2.12/2.5.4/akka-protobuf_2.12-2.5.4.jar ...
19-Oct-2017 08:57:53 [info]         [SUCCESSFUL ] com.spotify#docker-client;3.5.13!docker-client.jar (32ms)
19-Oct-2017 08:57:53 [info] downloading https://repo1.maven.org/maven2/org/apache/ant/ant-launcher/1.10.1/ant-launcher-1.10.1.jar ...
19-Oct-2017 08:57:53 [info]         [SUCCESSFUL ] net.java.dev.jna#jna;4.2.1!jna.jar (76ms)
19-Oct-2017 08:57:53 [info] downloading https://repo1.maven.org/maven2/com/google/guava/guava/23.0/guava-23.0.jar ...
19-Oct-2017 08:57:53 [info]         [SUCCESSFUL ] com.typesafe.akka#akka-protobuf_2.12;2.5.4!akka-protobuf_2.12.jar (44ms)
19-Oct-2017 08:57:53 [info] downloading https://repo1.maven.org/maven2/org/glassfish/jersey/core/jersey-client/2.19/jersey-client-2.19.jar ...
19-Oct-2017 08:57:53 [info]         [SUCCESSFUL ] org.apache.ant#ant-launcher;1.10.1!ant-launcher.jar (28ms)
19-Oct-2017 08:57:53 [info] downloading https://repo1.maven.org/maven2/com/fasterxml/jackson/jaxrs/jackson-jaxrs-json-provider/2.6.0/jackson-jaxrs-json-provider-2.6.0.jar ...
19-Oct-2017 08:57:53 [info]         [SUCCESSFUL ] org.glassfish.jersey.core#jersey-client;2.19!jersey-client.jar (26ms)
19-Oct-2017 08:57:53 [info] downloading https://repo1.maven.org/maven2/org/glassfish/jersey/connectors/jersey-apache-connector/2.19/jersey-apache-connector-2.19.jar ...
19-Oct-2017 08:57:53 [info]         [SUCCESSFUL ] com.fasterxml.jackson.jaxrs#jackson-jaxrs-json-provider;2.6.0!jackson-jaxrs-json-provider.jar(bundle) (23ms)
19-Oct-2017 08:57:53 [info]         [SUCCESSFUL ] org.glassfish.jersey.connectors#jersey-apache-connector;2.19!jersey-apache-connector.jar (19ms)
19-Oct-2017 08:57:53 [info] downloading https://repo1.maven.org/maven2/org/glassfish/jersey/media/jersey-media-json-jackson/2.19/jersey-media-json-jackson-2.19.jar ...
19-Oct-2017 08:57:53 [info] downloading https://repo1.maven.org/maven2/com/fasterxml/jackson/datatype/jackson-datatype-guava/2.6.0/jackson-datatype-guava-2.6.0.jar ...
19-Oct-2017 08:57:53 [info]         [SUCCESSFUL ] org.glassfish.jersey.media#jersey-media-json-jackson;2.19!jersey-media-json-jackson.jar (28ms)
19-Oct-2017 08:57:53 [info]         [SUCCESSFUL ] com.fasterxml.jackson.datatype#jackson-datatype-guava;2.6.0!jackson-datatype-guava.jar(bundle) (28ms)
19-Oct-2017 08:57:53 [info] downloading https://repo1.maven.org/maven2/org/apache/httpcomponents/httpclient/4.5/httpclient-4.5.jar ...
19-Oct-2017 08:57:53 [info] downloading https://repo1.maven.org/maven2/com/fasterxml/jackson/core/jackson-databind/2.6.0/jackson-databind-2.6.0.jar ...
19-Oct-2017 08:57:53 [info]         [SUCCESSFUL ] com.google.guava#guava;23.0!guava.jar(bundle) (122ms)
19-Oct-2017 08:57:53 [info] downloading https://repo1.maven.org/maven2/com/google/errorprone/error_prone_annotations/2.0.18/error_prone_annotations-2.0.18.jar ...
19-Oct-2017 08:57:53 [info]         [SUCCESSFUL ] com.google.errorprone#error_prone_annotations;2.0.18!error_prone_annotations.jar (22ms)
19-Oct-2017 08:57:53 [info] downloading https://repo1.maven.org/maven2/com/google/j2objc/j2objc-annotations/1.1/j2objc-annotations-1.1.jar ...
19-Oct-2017 08:57:53 [info]         [SUCCESSFUL ] org.apache.httpcomponents#httpclient;4.5!httpclient.jar (65ms)
19-Oct-2017 08:57:53 [info] downloading https://repo1.maven.org/maven2/com/github/jnr/jnr-unixsocket/0.8/jnr-unixsocket-0.8.jar ...
19-Oct-2017 08:57:53 [info]         [SUCCESSFUL ] com.fasterxml.jackson.core#jackson-databind;2.6.0!jackson-databind.jar(bundle) (67ms)
19-Oct-2017 08:57:53 [info] downloading https://repo1.maven.org/maven2/org/bouncycastle/bcpkix-jdk15on/1.52/bcpkix-jdk15on-1.52.jar ...
19-Oct-2017 08:57:53 [info]         [SUCCESSFUL ] com.google.j2objc#j2objc-annotations;1.1!j2objc-annotations.jar (20ms)
19-Oct-2017 08:57:53 [info] downloading https://repo1.maven.org/maven2/org/codehaus/mojo/animal-sniffer-annotations/1.14/animal-sniffer-annotations-1.14.jar ...
19-Oct-2017 08:57:53 [info]         [SUCCESSFUL ] com.github.jnr#jnr-unixsocket;0.8!jnr-unixsocket.jar (20ms)
19-Oct-2017 08:57:53 [info]         [SUCCESSFUL ] org.codehaus.mojo#animal-sniffer-annotations;1.14!animal-sniffer-annotations.jar (20ms)
19-Oct-2017 08:57:53 [info] downloading https://repo1.maven.org/maven2/com/typesafe/play/twirl-compiler_2.12/1.3.12/twirl-compiler_2.12-1.3.12.jar ...
19-Oct-2017 08:57:53 [info]         [SUCCESSFUL ] org.bouncycastle#bcpkix-jdk15on;1.52!bcpkix-jdk15on.jar (45ms)
19-Oct-2017 08:57:53 [info] downloading https://repo1.maven.org/maven2/com/fasterxml/jackson/jaxrs/jackson-jaxrs-base/2.6.0/jackson-jaxrs-base-2.6.0.jar ...
19-Oct-2017 08:57:53 [info]         [SUCCESSFUL ] com.typesafe.play#twirl-compiler_2.12;1.3.12!twirl-compiler_2.12.jar (22ms)
19-Oct-2017 08:57:53 [info]         [SUCCESSFUL ] com.fasterxml.jackson.jaxrs#jackson-jaxrs-base;2.6.0!jackson-jaxrs-base.jar(bundle) (22ms)
19-Oct-2017 08:57:53 [info] downloading https://repo1.maven.org/maven2/com/fasterxml/jackson/module/jackson-module-jaxb-annotations/2.6.0/jackson-module-jaxb-annotations-2.6.0.jar ...
19-Oct-2017 08:57:53 [info]         [SUCCESSFUL ] com.fasterxml.jackson.module#jackson-module-jaxb-annotations;2.6.0!jackson-module-jaxb-annotations.jar(bundle) (22ms)
19-Oct-2017 08:57:53 [info] downloading https://repo1.maven.org/maven2/com/fasterxml/jackson/core/jackson-annotations/2.6.0/jackson-annotations-2.6.0.jar ...
19-Oct-2017 08:57:53 [info]         [SUCCESSFUL ] com.fasterxml.jackson.core#jackson-annotations;2.6.0!jackson-annotations.jar(bundle) (22ms)
19-Oct-2017 08:57:53 [info] downloading https://repo1.maven.org/maven2/javax/ws/rs/javax.ws.rs-api/2.0.1/javax.ws.rs-api-2.0.1.jar ...
19-Oct-2017 08:57:53 [info]         [SUCCESSFUL ] javax.ws.rs#javax.ws.rs-api;2.0.1!javax.ws.rs-api.jar (24ms)
19-Oct-2017 08:57:53 [info] downloading https://repo.scala-sbt.org/scalasbt/sbt-plugin-releases/com.typesafe.sbt/sbt-native-packager/scala_2.12/sbt_1.0//1.2.2/jars/sbt-native-packager.jar ...
19-Oct-2017 08:57:53 [info]         [SUCCESSFUL ] com.typesafe.sbt#sbt-twirl;1.3.12!sbt-twirl.jar (996ms)
19-Oct-2017 08:57:54 [info]         [SUCCESSFUL ] com.typesafe.sbt#sbt-native-packager;1.2.2!sbt-native-packager.jar (723ms)
19-Oct-2017 08:57:54 [info] downloading https://repo.scala-sbt.org/scalasbt/sbt-plugin-releases/com.lightbend.sbt/sbt-javaagent/scala_2.12/sbt_1.0//0.1.4/jars/sbt-javaagent.jar ...
19-Oct-2017 08:57:54 [info]         [SUCCESSFUL ] com.lightbend.sbt#sbt-javaagent;0.1.4!sbt-javaagent.jar (590ms)
19-Oct-2017 08:57:54 [info] downloading https://repo.scala-sbt.org/scalasbt/sbt-plugin-releases/com.typesafe.sbt/sbt-web/scala_2.12/sbt_1.0//1.4.2/jars/sbt-web.jar ...
19-Oct-2017 08:57:55 [info]         [SUCCESSFUL ] com.typesafe.sbt#sbt-web;1.4.2!sbt-web.jar (634ms)
19-Oct-2017 08:57:55 [info] downloading https://repo.scala-sbt.org/scalasbt/sbt-plugin-releases/com.typesafe.sbt/sbt-js-engine/scala_2.12/sbt_1.0//1.2.2/jars/sbt-js-engine.jar ...
19-Oct-2017 08:57:56 [info]         [SUCCESSFUL ] com.typesafe.sbt#sbt-js-engine;1.2.2!sbt-js-engine.jar (593ms)
19-Oct-2017 08:57:56 [info] downloading https://repo1.maven.org/maven2/com/typesafe/play/twirl-api_2.12/1.3.12/twirl-api_2.12-1.3.12.jar ...
19-Oct-2017 08:57:56 [info]         [SUCCESSFUL ] com.typesafe.play#twirl-api_2.12;1.3.12!twirl-api_2.12.jar (24ms)
19-Oct-2017 08:57:56 [info] Done updating.
19-Oct-2017 08:57:56 [warn] Found version conflict(s) in library dependencies; some are suspected to be binary incompatible:
19-Oct-2017 08:57:56 [warn]         * org.codehaus.plexus:plexus-utils:3.0.17 is selected over {2.1, 1.5.5}
19-Oct-2017 08:57:56 [warn]             +- org.apache.maven:maven-settings:3.2.2              (depends on 3.0.17)
19-Oct-2017 08:57:56 [warn]             +- org.apache.maven:maven-repository-metadata:3.2.2   (depends on 3.0.17)
19-Oct-2017 08:57:56 [warn]             +- org.apache.maven:maven-aether-provider:3.2.2       (depends on 3.0.17)
19-Oct-2017 08:57:56 [warn]             +- org.apache.maven:maven-model:3.2.2                 (depends on 3.0.17)
19-Oct-2017 08:57:56 [warn]             +- org.apache.maven:maven-core:3.2.2                  (depends on 3.0.17)
19-Oct-2017 08:57:56 [warn]             +- org.apache.maven:maven-artifact:3.2.2              (depends on 3.0.17)
19-Oct-2017 08:57:56 [warn]             +- org.apache.maven:maven-settings-builder:3.2.2      (depends on 3.0.17)
19-Oct-2017 08:57:56 [warn]             +- org.apache.maven:maven-model-builder:3.2.2         (depends on 3.0.17)
19-Oct-2017 08:57:56 [warn]             +- org.sonatype.plexus:plexus-sec-dispatcher:1.3      (depends on 1.5.5)
19-Oct-2017 08:57:56 [warn]             +- org.eclipse.sisu:org.eclipse.sisu.plexus:0.0.0.M5  (depends on 2.1)
19-Oct-2017 08:57:56 [warn]         * com.google.guava:guava:23.0 is selected over {10.0.1, 15.0, 18.0}
19-Oct-2017 08:57:56 [warn]             +- io.methvin:directory-watcher:0.1.3                 (depends on 10.0.1)
19-Oct-2017 08:57:56 [warn]             +- org.eclipse.sisu:org.eclipse.sisu.plexus:0.0.0.M5  (depends on 10.0.1)
19-Oct-2017 08:57:56 [warn]             +- com.fasterxml.jackson.datatype:jackson-datatype-guava:2.6.0 (depends on 10.0.1)
19-Oct-2017 08:57:56 [warn]             +- com.spotify:docker-client:3.5.13                   (depends on 10.0.1)
19-Oct-2017 08:57:56 [warn] Run 'evicted' to see detailed eviction warnings
19-Oct-2017 08:58:00 [info] Loading settings from build.sbt ...
19-Oct-2017 08:58:00 [info] Set current project to tools-catalog (in build file:/home/bamboo/bamboo-agent-home/xml-data/build-dir/BD-TC90-JOB1/)
19-Oct-2017 08:58:01 [success] Total time: 0 s, completed Oct 19, 2017 8:58:01 AM
19-Oct-2017 08:58:01 [info] Updating {file:/home/bamboo/bamboo-agent-home/xml-data/build-dir/BD-TC90-JOB1/}root...
19-Oct-2017 08:58:15 [info] downloading https://repo1.maven.org/maven2/org/scala-lang/scala-library/2.12.2/scala-library-2.12.2.jar ...
19-Oct-2017 08:58:15 [info] downloading https://repo1.maven.org/maven2/com/typesafe/play/play-functional_2.12/2.6.6/play-functional_2.12-2.6.6.jar ...
19-Oct-2017 08:58:15 [info] downloading https://repo1.maven.org/maven2/com/fasterxml/jackson/core/jackson-databind/2.8.10/jackson-databind-2.8.10.jar ...
19-Oct-2017 08:58:15 [info] downloading https://repo1.maven.org/maven2/org/atteo/classindex/classindex/3.4/classindex-3.4.jar ...
19-Oct-2017 08:58:15 [info]         [SUCCESSFUL ] org.atteo.classindex#classindex;3.4!classindex.jar (113ms)
19-Oct-2017 08:58:15 [info] downloading https://repo1.maven.org/maven2/cglib/cglib-nodep/3.2.4/cglib-nodep-3.2.4.jar ...
19-Oct-2017 08:58:15 [info]         [SUCCESSFUL ] com.typesafe.play#play-functional_2.12;2.6.6!play-functional_2.12.jar (163ms)
19-Oct-2017 08:58:15 [info] downloading https://repo1.maven.org/maven2/org/typelevel/macro-compat_2.12/1.1.1/macro-compat_2.12-1.1.1.jar ...
19-Oct-2017 08:58:15 [info]         [SUCCESSFUL ] org.typelevel#macro-compat_2.12;1.1.1!macro-compat_2.12.jar (20ms)
19-Oct-2017 08:58:15 [info] downloading https://repo1.maven.org/maven2/joda-time/joda-time/2.9.9/joda-time-2.9.9.jar ...
19-Oct-2017 08:58:15 [info]         [SUCCESSFUL ] cglib#cglib-nodep;3.2.4!cglib-nodep.jar (57ms)
19-Oct-2017 08:58:15 [info] downloading https://repo1.maven.org/maven2/com/google/code/gson/gson/2.8.0/gson-2.8.0.jar ...
19-Oct-2017 08:58:15 [info]         [SUCCESSFUL ] com.google.code.gson#gson;2.8.0!gson.jar (41ms)
19-Oct-2017 08:58:15 [info] downloading https://repo1.maven.org/maven2/net/sourceforge/htmlunit/htmlunit/2.27/htmlunit-2.27.jar ...
19-Oct-2017 08:58:15 [info]         [SUCCESSFUL ] joda-time#joda-time;2.9.9!joda-time.jar (87ms)
19-Oct-2017 08:58:15 [info] downloading https://repo1.maven.org/maven2/ch/qos/logback/logback-classic/1.2.3/logback-classic-1.2.3.jar ...
19-Oct-2017 08:58:16 [info]         [SUCCESSFUL ] com.fasterxml.jackson.core#jackson-databind;2.8.10!jackson-databind.jar(bundle) (270ms)
19-Oct-2017 08:58:16 [info] downloading https://repo1.maven.org/maven2/com/fasterxml/jackson/datatype/jackson-datatype-jdk8/2.8.10/jackson-datatype-jdk8-2.8.10.jar ...
19-Oct-2017 08:58:16 [info]         [SUCCESSFUL ] com.fasterxml.jackson.datatype#jackson-datatype-jdk8;2.8.10!jackson-datatype-jdk8.jar(bundle) (21ms)
19-Oct-2017 08:58:16 [info] downloading https://repo1.maven.org/maven2/com/fasterxml/jackson/datatype/jackson-datatype-jsr310/2.8.10/jackson-datatype-jsr310-2.8.10.jar ...
19-Oct-2017 08:58:16 [info]         [SUCCESSFUL ] org.scala-lang#scala-library;2.12.2!scala-library.jar (328ms)
19-Oct-2017 08:58:16 [info] downloading https://repo1.maven.org/maven2/com/typesafe/play/play-server_2.12/2.6.6/play-server_2.12-2.6.6.jar ...
19-Oct-2017 08:58:16 [info]         [SUCCESSFUL ] ch.qos.logback#logback-classic;1.2.3!logback-classic.jar (55ms)
19-Oct-2017 08:58:16 [info] downloading https://repo1.maven.org/maven2/ch/qos/logback/logback-core/1.2.3/logback-core-1.2.3.jar ...
19-Oct-2017 08:58:16 [info]         [SUCCESSFUL ] com.fasterxml.jackson.datatype#jackson-datatype-jsr310;2.8.10!jackson-datatype-jsr310.jar(bundle) (30ms)
19-Oct-2017 08:58:16 [info] downloading https://repo1.maven.org/maven2/com/typesafe/play/play-json_2.12/2.6.6/play-json_2.12-2.6.6.jar ...
19-Oct-2017 08:58:16 [info]         [SUCCESSFUL ] ch.qos.logback#logback-core;1.2.3!logback-core.jar (37ms)
19-Oct-2017 08:58:16 [info] downloading https://repo1.maven.org/maven2/com/typesafe/akka/akka-http-core_2.12/10.0.10/akka-http-core_2.12-10.0.10.jar ...
19-Oct-2017 08:58:16 [info]         [SUCCESSFUL ] com.typesafe.play#play-server_2.12;2.6.6!play-server_2.12.jar (65ms)
19-Oct-2017 08:58:16 [info] downloading https://repo1.maven.org/maven2/com/typesafe/play/filters-helpers_2.12/2.6.6/filters-helpers_2.12-2.6.6.jar ...
19-Oct-2017 08:58:16 [info]         [SUCCESSFUL ] net.sourceforge.htmlunit#htmlunit;2.27!htmlunit.jar (174ms)
19-Oct-2017 08:58:16 [info] downloading https://repo1.maven.org/maven2/org/apache/httpcomponents/httpmime/4.5.3/httpmime-4.5.3.jar ...
19-Oct-2017 08:58:16 [info]         [SUCCESSFUL ] com.typesafe.play#filters-helpers_2.12;2.6.6!filters-helpers_2.12.jar (43ms)
19-Oct-2017 08:58:16 [info] downloading https://repo1.maven.org/maven2/com/typesafe/play/play-logback_2.12/2.6.6/play-logback_2.12-2.6.6.jar ...
19-Oct-2017 08:58:16 [info]         [SUCCESSFUL ] com.typesafe.play#play-json_2.12;2.6.6!play-json_2.12.jar (83ms)
19-Oct-2017 08:58:16 [info] downloading https://repo1.maven.org/maven2/com/google/guava/guava/22.0/guava-22.0.jar ...
19-Oct-2017 08:58:16 [info]         [SUCCESSFUL ] org.apache.httpcomponents#httpmime;4.5.3!httpmime.jar (22ms)
19-Oct-2017 08:58:16 [info] downloading https://repo1.maven.org/maven2/net/sourceforge/htmlunit/htmlunit-core-js/2.27/htmlunit-core-js-2.27.jar ...
19-Oct-2017 08:58:16 [info]         [SUCCESSFUL ] com.typesafe.play#play-logback_2.12;2.6.6!play-logback_2.12.jar (20ms)
19-Oct-2017 08:58:16 [info] downloading https://repo1.maven.org/maven2/com/typesafe/play/play-akka-http-server_2.12/2.6.6/play-akka-http-server_2.12-2.6.6.jar ...
19-Oct-2017 08:58:16 [info]         [SUCCESSFUL ] com.typesafe.play#play-akka-http-server_2.12;2.6.6!play-akka-http-server_2.12.jar (27ms)
19-Oct-2017 08:58:16 [info] downloading https://repo1.maven.org/maven2/com/typesafe/play/play-guice_2.12/2.6.6/play-guice_2.12-2.6.6.jar ...
19-Oct-2017 08:58:16 [info]         [SUCCESSFUL ] com.typesafe.akka#akka-http-core_2.12;10.0.10!akka-http-core_2.12.jar (135ms)
19-Oct-2017 08:58:16 [info] downloading https://repo1.maven.org/maven2/com/typesafe/akka/akka-parsing_2.12/10.0.10/akka-parsing_2.12-10.0.10.jar ...
19-Oct-2017 08:58:16 [info]         [SUCCESSFUL ] com.typesafe.play#play-guice_2.12;2.6.6!play-guice_2.12.jar (33ms)
19-Oct-2017 08:58:16 [info] downloading https://repo1.maven.org/maven2/org/reactivemongo/reactivemongo_2.12/0.12.6/reactivemongo_2.12-0.12.6.jar ...
19-Oct-2017 08:58:16 [info]         [SUCCESSFUL ] net.sourceforge.htmlunit#htmlunit-core-js;2.27!htmlunit-core-js.jar (119ms)
19-Oct-2017 08:58:16 [info] downloading https://repo1.maven.org/maven2/net/sourceforge/htmlunit/neko-htmlunit/2.27/neko-htmlunit-2.27.jar ...
19-Oct-2017 08:58:16 [info]         [SUCCESSFUL ] com.typesafe.akka#akka-parsing_2.12;10.0.10!akka-parsing_2.12.jar (93ms)
19-Oct-2017 08:58:16 [info] downloading https://repo1.maven.org/maven2/com/google/inject/guice/4.1.0/guice-4.1.0.jar ...
19-Oct-2017 08:58:16 [info]         [SUCCESSFUL ] net.sourceforge.htmlunit#neko-htmlunit;2.27!neko-htmlunit.jar (29ms)
19-Oct-2017 08:58:16 [info] downloading https://repo1.maven.org/maven2/net/sourceforge/cssparser/cssparser/0.9.23/cssparser-0.9.23.jar ...
19-Oct-2017 08:58:16 [info]         [SUCCESSFUL ] org.reactivemongo#reactivemongo_2.12;0.12.6!reactivemongo_2.12.jar (107ms)
19-Oct-2017 08:58:16 [info] downloading https://repo1.maven.org/maven2/com/typesafe/play/play_2.12/2.6.6/play_2.12-2.6.6.jar ...
19-Oct-2017 08:58:16 [info]         [SUCCESSFUL ] net.sourceforge.cssparser#cssparser;0.9.23!cssparser.jar (36ms)
19-Oct-2017 08:58:16 [info] downloading https://repo1.maven.org/maven2/org/eclipse/jetty/websocket/websocket-client/9.4.5.v20170502/websocket-client-9.4.5.v20170502.jar ...
19-Oct-2017 08:58:16 [info]         [SUCCESSFUL ] com.google.inject#guice;4.1.0!guice.jar (63ms)
19-Oct-2017 08:58:16 [info] downloading https://repo1.maven.org/maven2/com/google/inject/extensions/guice-assistedinject/4.1.0/guice-assistedinject-4.1.0.jar ...
19-Oct-2017 08:58:16 [info]         [SUCCESSFUL ] com.google.guava#guava;22.0!guava.jar(bundle) (225ms)
19-Oct-2017 08:58:16 [info] downloading https://repo1.maven.org/maven2/io/jsonwebtoken/jjwt/0.7.0/jjwt-0.7.0.jar ...
19-Oct-2017 08:58:16 [info]         [SUCCESSFUL ] org.eclipse.jetty.websocket#websocket-client;9.4.5.v20170502!websocket-client.jar (21ms)
19-Oct-2017 08:58:16 [info] downloading https://repo1.maven.org/maven2/org/eclipse/jetty/jetty-util/9.4.5.v20170502/jetty-util-9.4.5.v20170502.jar ...
19-Oct-2017 08:58:16 [info]         [SUCCESSFUL ] com.google.inject.extensions#guice-assistedinject;4.1.0!guice-assistedinject.jar (57ms)
19-Oct-2017 08:58:16 [info] downloading https://repo1.maven.org/maven2/org/reactivemongo/reactivemongo-bson-macros_2.12/0.12.6/reactivemongo-bson-macros_2.12-0.12.6.jar ...
19-Oct-2017 08:58:16 [info]         [SUCCESSFUL ] io.jsonwebtoken#jjwt;0.7.0!jjwt.jar (63ms)
19-Oct-2017 08:58:16 [info] downloading https://repo1.maven.org/maven2/org/apache/commons/commons-lang3/3.6/commons-lang3-3.6.jar ...
19-Oct-2017 08:58:16 [info]         [SUCCESSFUL ] org.reactivemongo#reactivemongo-bson-macros_2.12;0.12.6!reactivemongo-bson-macros_2.12.jar (28ms)
19-Oct-2017 08:58:16 [info] downloading https://repo1.maven.org/maven2/org/reactivemongo/reactivemongo-shaded/0.12.6/reactivemongo-shaded-0.12.6.jar ...
19-Oct-2017 08:58:16 [info]         [SUCCESSFUL ] org.eclipse.jetty#jetty-util;9.4.5.v20170502!jetty-util.jar (55ms)
19-Oct-2017 08:58:16 [info] downloading https://repo1.maven.org/maven2/org/eclipse/jetty/jetty-io/9.4.5.v20170502/jetty-io-9.4.5.v20170502.jar ...
19-Oct-2017 08:58:16 [info]         [SUCCESSFUL ] org.apache.commons#commons-lang3;3.6!commons-lang3.jar (51ms)
19-Oct-2017 08:58:16 [info] downloading https://repo1.maven.org/maven2/org/scala-lang/scala-reflect/2.12.2/scala-reflect-2.12.2.jar ...
19-Oct-2017 08:58:16 [info]         [SUCCESSFUL ] org.eclipse.jetty#jetty-io;9.4.5.v20170502!jetty-io.jar (28ms)
19-Oct-2017 08:58:16 [info] downloading https://repo1.maven.org/maven2/org/eclipse/jetty/jetty-client/9.4.5.v20170502/jetty-client-9.4.5.v20170502.jar ...
19-Oct-2017 08:58:16 [info]         [SUCCESSFUL ] com.typesafe.play#play_2.12;2.6.6!play_2.12.jar (206ms)
19-Oct-2017 08:58:16 [info] downloading https://repo1.maven.org/maven2/com/typesafe/play/play-netty-utils/2.6.6/play-netty-utils-2.6.6.jar ...
19-Oct-2017 08:58:16 [info]         [SUCCESSFUL ] org.eclipse.jetty#jetty-client;9.4.5.v20170502!jetty-client.jar (41ms)
19-Oct-2017 08:58:16 [info] downloading https://repo1.maven.org/maven2/org/eclipse/jetty/websocket/websocket-common/9.4.5.v20170502/websocket-common-9.4.5.v20170502.jar ...
19-Oct-2017 08:58:16 [info]         [SUCCESSFUL ] com.typesafe.play#play-netty-utils;2.6.6!play-netty-utils.jar (27ms)
19-Oct-2017 08:58:16 [info] downloading https://repo1.maven.org/maven2/com/typesafe/play/play-streams_2.12/2.6.6/play-streams_2.12-2.6.6.jar ...
19-Oct-2017 08:58:16 [info]         [SUCCESSFUL ] org.eclipse.jetty.websocket#websocket-common;9.4.5.v20170502!websocket-common.jar (30ms)
19-Oct-2017 08:58:16 [info] downloading https://repo1.maven.org/maven2/org/eclipse/jetty/jetty-http/9.4.5.v20170502/jetty-http-9.4.5.v20170502.jar ...
19-Oct-2017 08:58:16 [info]         [SUCCESSFUL ] com.typesafe.play#play-streams_2.12;2.6.6!play-streams_2.12.jar (26ms)
19-Oct-2017 08:58:16 [info] downloading https://repo1.maven.org/maven2/org/slf4j/jul-to-slf4j/1.7.25/jul-to-slf4j-1.7.25.jar ...
19-Oct-2017 08:58:16 [info]         [SUCCESSFUL ] org.slf4j#jul-to-slf4j;1.7.25!jul-to-slf4j.jar (24ms)
19-Oct-2017 08:58:16 [info]         [SUCCESSFUL ] org.eclipse.jetty#jetty-http;9.4.5.v20170502!jetty-http.jar (41ms)
19-Oct-2017 08:58:16 [info]         [SUCCESSFUL ] org.reactivemongo#reactivemongo-shaded;0.12.6!reactivemongo-shaded.jar (175ms)
19-Oct-2017 08:58:16 [info] downloading https://repo1.maven.org/maven2/com/typesafe/play/play-iteratees_2.12/2.6.1/play-iteratees_2.12-2.6.1.jar ...
19-Oct-2017 08:58:16 [info] downloading https://repo1.maven.org/maven2/org/eclipse/jetty/websocket/websocket-api/9.4.5.v20170502/websocket-api-9.4.5.v20170502.jar ...
19-Oct-2017 08:58:16 [info] downloading https://repo1.maven.org/maven2/org/slf4j/jcl-over-slf4j/1.7.25/jcl-over-slf4j-1.7.25.jar ...
19-Oct-2017 08:58:16 [info]         [SUCCESSFUL ] com.typesafe.play#play-iteratees_2.12;2.6.1!play-iteratees_2.12.jar (53ms)
19-Oct-2017 08:58:16 [info]         [SUCCESSFUL ] org.eclipse.jetty.websocket#websocket-api;9.4.5.v20170502!websocket-api.jar (48ms)
19-Oct-2017 08:58:16 [info]         [SUCCESSFUL ] org.slf4j#jcl-over-slf4j;1.7.25!jcl-over-slf4j.jar (48ms)
19-Oct-2017 08:58:16 [info] downloading https://repo1.maven.org/maven2/com/chuusai/shapeless_2.12/2.3.2/shapeless_2.12-2.3.2.jar ...
19-Oct-2017 08:58:16 [info] downloading https://repo1.maven.org/maven2/org/seleniumhq/selenium/selenium-remote-driver/3.5.3/selenium-remote-driver-3.5.3.jar ...
19-Oct-2017 08:58:16 [info] downloading https://repo1.maven.org/maven2/com/typesafe/akka/akka-slf4j_2.12/2.5.4/akka-slf4j_2.12-2.5.4.jar ...
19-Oct-2017 08:58:16 [info]         [SUCCESSFUL ] com.typesafe.akka#akka-slf4j_2.12;2.5.4!akka-slf4j_2.12.jar (23ms)
19-Oct-2017 08:58:16 [info]         [SUCCESSFUL ] org.scala-lang#scala-reflect;2.12.2!scala-reflect.jar (219ms)
19-Oct-2017 08:58:16 [info] downloading https://repo1.maven.org/maven2/com/fasterxml/jackson/core/jackson-core/2.8.10/jackson-core-2.8.10.jar ...
19-Oct-2017 08:58:16 [info] downloading https://repo1.maven.org/maven2/com/codeborne/phantomjsdriver/1.4.3/phantomjsdriver-1.4.3.jar ...
19-Oct-2017 08:58:16 [info]         [SUCCESSFUL ] org.seleniumhq.selenium#selenium-remote-driver;3.5.3!selenium-remote-driver.jar (35ms)
19-Oct-2017 08:58:16 [info] downloading https://repo1.maven.org/maven2/org/scalatest/scalatest_2.12/3.0.4/scalatest_2.12-3.0.4.jar ...
19-Oct-2017 08:58:16 [info]         [SUCCESSFUL ] com.codeborne#phantomjsdriver;1.4.3!phantomjsdriver.jar (21ms)
19-Oct-2017 08:58:16 [info] downloading https://repo1.maven.org/maven2/com/typesafe/play/play-ws_2.12/2.6.5/play-ws_2.12-2.6.5.jar ...
19-Oct-2017 08:58:16 [info]         [SUCCESSFUL ] com.fasterxml.jackson.core#jackson-core;2.8.10!jackson-core.jar(bundle) (30ms)
19-Oct-2017 08:58:16 [info] downloading https://repo1.maven.org/maven2/com/fasterxml/jackson/core/jackson-annotations/2.8.10/jackson-annotations-2.8.10.jar ...
19-Oct-2017 08:58:16 [info]         [SUCCESSFUL ] com.typesafe.play#play-ws_2.12;2.6.5!play-ws_2.12.jar (20ms)
19-Oct-2017 08:58:16 [info] downloading https://repo1.maven.org/maven2/com/typesafe/play/play-ahc-ws_2.12/2.6.5/play-ahc-ws_2.12-2.6.5.jar ...
19-Oct-2017 08:58:16 [info]         [SUCCESSFUL ] com.fasterxml.jackson.core#jackson-annotations;2.8.10!jackson-annotations.jar(bundle) (21ms)
19-Oct-2017 08:58:16 [info]         [SUCCESSFUL ] com.typesafe.play#play-ahc-ws_2.12;2.6.5!play-ahc-ws_2.12.jar (24ms)
19-Oct-2017 08:58:16 [info] downloading https://repo1.maven.org/maven2/org/scalactic/scalactic_2.12/3.0.4/scalactic_2.12-3.0.4.jar ...
19-Oct-2017 08:58:16 [info]         [SUCCESSFUL ] org.scalactic#scalactic_2.12;3.0.4!scalactic_2.12.jar(bundle) (46ms)
19-Oct-2017 08:58:16 [info] downloading https://repo1.maven.org/maven2/org/seleniumhq/selenium/selenium-chrome-driver/3.5.3/selenium-chrome-driver-3.5.3.jar ...
19-Oct-2017 08:58:16 [info]         [SUCCESSFUL ] com.chuusai#shapeless_2.12;2.3.2!shapeless_2.12.jar(bundle) (148ms)
19-Oct-2017 08:58:16 [info] downloading https://repo1.maven.org/maven2/org/apache/logging/log4j/log4j-api/2.5/log4j-api-2.5.jar ...
19-Oct-2017 08:58:16 [info]         [SUCCESSFUL ] org.seleniumhq.selenium#selenium-chrome-driver;3.5.3!selenium-chrome-driver.jar (20ms)
19-Oct-2017 08:58:16 [info] downloading https://repo1.maven.org/maven2/org/seleniumhq/selenium/selenium-edge-driver/3.5.3/selenium-edge-driver-3.5.3.jar ...
19-Oct-2017 08:58:16 [info]         [SUCCESSFUL ] org.apache.logging.log4j#log4j-api;2.5!log4j-api.jar (29ms)
19-Oct-2017 08:58:16 [info] downloading https://repo1.maven.org/maven2/org/reactivemongo/reactivemongo-bson_2.12/0.12.6/reactivemongo-bson_2.12-0.12.6.jar ...
19-Oct-2017 08:58:16 [info]         [SUCCESSFUL ] org.seleniumhq.selenium#selenium-edge-driver;3.5.3!selenium-edge-driver.jar (20ms)
19-Oct-2017 08:58:16 [info] downloading https://repo1.maven.org/maven2/org/seleniumhq/selenium/selenium-ie-driver/3.5.3/selenium-ie-driver-3.5.3.jar ...
19-Oct-2017 08:58:16 [info]         [SUCCESSFUL ] org.seleniumhq.selenium#selenium-ie-driver;3.5.3!selenium-ie-driver.jar (21ms)
19-Oct-2017 08:58:16 [info] downloading https://repo1.maven.org/maven2/org/seleniumhq/selenium/selenium-opera-driver/3.5.3/selenium-opera-driver-3.5.3.jar ...
19-Oct-2017 08:58:16 [info]         [SUCCESSFUL ] org.reactivemongo#reactivemongo-bson_2.12;0.12.6!reactivemongo-bson_2.12.jar (37ms)
19-Oct-2017 08:58:16 [info] downloading https://repo1.maven.org/maven2/org/scala-stm/scala-stm_2.12/0.8/scala-stm_2.12-0.8.jar ...
19-Oct-2017 08:58:16 [info]         [SUCCESSFUL ] org.seleniumhq.selenium#selenium-opera-driver;3.5.3!selenium-opera-driver.jar (20ms)
19-Oct-2017 08:58:16 [info] downloading https://repo1.maven.org/maven2/org/seleniumhq/selenium/selenium-safari-driver/3.5.3/selenium-safari-driver-3.5.3.jar ...
19-Oct-2017 08:58:16 [info]         [SUCCESSFUL ] org.seleniumhq.selenium#selenium-safari-driver;3.5.3!selenium-safari-driver.jar (19ms)
19-Oct-2017 08:58:16 [info] downloading https://repo1.maven.org/maven2/javax/servlet/javax.servlet-api/3.1.0/javax.servlet-api-3.1.0.jar ...
19-Oct-2017 08:58:16 [info]         [SUCCESSFUL ] org.scala-stm#scala-stm_2.12;0.8!scala-stm_2.12.jar (48ms)
19-Oct-2017 08:58:16 [info] downloading https://repo1.maven.org/maven2/com/typesafe/play/play-test_2.12/2.6.6/play-test_2.12-2.6.6.jar ...
19-Oct-2017 08:58:16 [info]         [SUCCESSFUL ] javax.servlet#javax.servlet-api;3.1.0!javax.servlet-api.jar (25ms)
19-Oct-2017 08:58:16 [info] downloading https://repo1.maven.org/maven2/com/typesafe/play/play-ws-standalone_2.12/1.1.0/play-ws-standalone_2.12-1.1.0.jar ...
19-Oct-2017 08:58:16 [info]         [SUCCESSFUL ] com.typesafe.play#play-test_2.12;2.6.6!play-test_2.12.jar (27ms)
19-Oct-2017 08:58:16 [info] downloading https://repo1.maven.org/maven2/org/scalatestplus/play/scalatestplus-play_2.12/3.1.2/scalatestplus-play_2.12-3.1.2.jar ...
19-Oct-2017 08:58:16 [info]         [SUCCESSFUL ] com.typesafe.play#play-ws-standalone_2.12;1.1.0!play-ws-standalone_2.12.jar (23ms)
19-Oct-2017 08:58:16 [info] downloading https://repo1.maven.org/maven2/com/typesafe/play/play-ws-standalone-xml_2.12/1.1.0/play-ws-standalone-xml_2.12-1.1.0.jar ...
19-Oct-2017 08:58:17 [info]         [SUCCESSFUL ] com.typesafe.play#play-ws-standalone-xml_2.12;1.1.0!play-ws-standalone-xml_2.12.jar (19ms)
19-Oct-2017 08:58:17 [info] downloading https://repo1.maven.org/maven2/com/typesafe/play/play-ws-standalone-json_2.12/1.1.0/play-ws-standalone-json_2.12-1.1.0.jar ...
19-Oct-2017 08:58:17 [info]         [SUCCESSFUL ] org.scalatestplus.play#scalatestplus-play_2.12;3.1.2!scalatestplus-play_2.12.jar (30ms)
19-Oct-2017 08:58:17 [info] downloading https://repo1.maven.org/maven2/com/google/code/findbugs/jsr305/3.0.2/jsr305-3.0.2.jar ...
19-Oct-2017 08:58:17 [info]         [SUCCESSFUL ] com.typesafe.play#play-ws-standalone-json_2.12;1.1.0!play-ws-standalone-json_2.12.jar (23ms)
19-Oct-2017 08:58:17 [info] downloading https://repo1.maven.org/maven2/com/typesafe/play/play-ahc-ws-standalone_2.12/1.1.0/play-ahc-ws-standalone_2.12-1.1.0.jar ...
19-Oct-2017 08:58:17 [info]         [SUCCESSFUL ] com.google.code.findbugs#jsr305;3.0.2!jsr305.jar (31ms)
19-Oct-2017 08:58:17 [info] downloading https://repo1.maven.org/maven2/org/fluentlenium/fluentlenium-core/3.3.0/fluentlenium-core-3.3.0.jar ...
19-Oct-2017 08:58:17 [info]         [SUCCESSFUL ] org.scalatest#scalatest_2.12;3.0.4!scalatest_2.12.jar(bundle) (325ms)
19-Oct-2017 08:58:17 [info] downloading https://repo1.maven.org/maven2/org/seleniumhq/selenium/selenium-java/3.5.3/selenium-java-3.5.3.jar ...
19-Oct-2017 08:58:17 [info]         [SUCCESSFUL ] com.typesafe.play#play-ahc-ws-standalone_2.12;1.1.0!play-ahc-ws-standalone_2.12.jar (33ms)
19-Oct-2017 08:58:17 [info] downloading https://repo1.maven.org/maven2/com/typesafe/play/shaded-asynchttpclient/1.1.0/shaded-asynchttpclient-1.1.0.jar ...
19-Oct-2017 08:58:17 [info]         [SUCCESSFUL ] org.seleniumhq.selenium#selenium-java;3.5.3!selenium-java.jar (20ms)
19-Oct-2017 08:58:17 [info] downloading https://repo1.maven.org/maven2/com/typesafe/play/shaded-oauth/1.1.0/shaded-oauth-1.1.0.jar ...
19-Oct-2017 08:58:17 [info]         [SUCCESSFUL ] org.fluentlenium#fluentlenium-core;3.3.0!fluentlenium-core.jar (36ms)
19-Oct-2017 08:58:17 [info] downloading https://repo1.maven.org/maven2/org/seleniumhq/selenium/htmlunit-driver/2.27/htmlunit-driver-2.27.jar ...
19-Oct-2017 08:58:17 [info]         [SUCCESSFUL ] com.typesafe.play#shaded-oauth;1.1.0!shaded-oauth.jar (23ms)
19-Oct-2017 08:58:17 [info] downloading https://repo1.maven.org/maven2/javax/cache/cache-api/1.0.0/cache-api-1.0.0.jar ...
19-Oct-2017 08:58:17 [info]         [SUCCESSFUL ] org.seleniumhq.selenium#htmlunit-driver;2.27!htmlunit-driver.jar (23ms)
19-Oct-2017 08:58:17 [info] downloading https://repo1.maven.org/maven2/org/seleniumhq/selenium/selenium-api/3.5.3/selenium-api-3.5.3.jar ...
19-Oct-2017 08:58:17 [info]         [SUCCESSFUL ] javax.cache#cache-api;1.0.0!cache-api.jar (22ms)
19-Oct-2017 08:58:17 [info] downloading https://repo1.maven.org/maven2/com/typesafe/play/cachecontrol_2.12/1.1.2/cachecontrol_2.12-1.1.2.jar ...
19-Oct-2017 08:58:17 [info]         [SUCCESSFUL ] org.seleniumhq.selenium#selenium-api;3.5.3!selenium-api.jar (24ms)
19-Oct-2017 08:58:17 [info] downloading https://repo1.maven.org/maven2/org/seleniumhq/selenium/selenium-support/3.5.3/selenium-support-3.5.3.jar ...
19-Oct-2017 08:58:17 [info]         [SUCCESSFUL ] com.typesafe.play#cachecontrol_2.12;1.1.2!cachecontrol_2.12.jar (31ms)
19-Oct-2017 08:58:17 [info] downloading https://repo1.maven.org/maven2/org/scala-lang/scala-compiler/2.12.2/scala-compiler-2.12.2.jar ...
19-Oct-2017 08:58:17 [info]         [SUCCESSFUL ] org.seleniumhq.selenium#selenium-support;3.5.3!selenium-support.jar (25ms)
19-Oct-2017 08:58:17 [info] downloading https://repo1.maven.org/maven2/org/seleniumhq/selenium/selenium-firefox-driver/3.5.3/selenium-firefox-driver-3.5.3.jar ...
19-Oct-2017 08:58:17 [info]         [SUCCESSFUL ] com.typesafe.play#shaded-asynchttpclient;1.1.0!shaded-asynchttpclient.jar (152ms)
19-Oct-2017 08:58:17 [info] downloading https://repo1.maven.org/maven2/com/typesafe/play/play-omnidoc_2.12/2.6.6/play-omnidoc_2.12-2.6.6.jar ...
19-Oct-2017 08:58:17 [info]         [SUCCESSFUL ] org.seleniumhq.selenium#selenium-firefox-driver;3.5.3!selenium-firefox-driver.jar (63ms)
19-Oct-2017 08:58:17 [info] downloading https://repo1.maven.org/maven2/org/parboiled/parboiled-java/1.1.7/parboiled-java-1.1.7.jar ...
19-Oct-2017 08:58:17 [info]         [SUCCESSFUL ] org.parboiled#parboiled-java;1.1.7!parboiled-java.jar (24ms)
19-Oct-2017 08:58:17 [info] downloading https://repo1.maven.org/maven2/org/parboiled/parboiled-core/1.1.7/parboiled-core-1.1.7.jar ...
19-Oct-2017 08:58:17 [info]         [SUCCESSFUL ] org.parboiled#parboiled-core;1.1.7!parboiled-core.jar (27ms)
19-Oct-2017 08:58:17 [info]         [SUCCESSFUL ] org.scala-lang#scala-compiler;2.12.2!scala-compiler.jar (419ms)
19-Oct-2017 08:58:17 [info] downloading https://repo1.maven.org/maven2/jline/jline/2.14.3/jline-2.14.3.jar ...
19-Oct-2017 08:58:17 [info]         [SUCCESSFUL ] jline#jline;2.14.3!jline.jar (32ms)
19-Oct-2017 08:58:17 [info]         [SUCCESSFUL ] com.typesafe.play#play-omnidoc_2.12;2.6.6!play-omnidoc_2.12.jar (602ms)
19-Oct-2017 08:58:17 [info] downloading https://repo1.maven.org/maven2/com/typesafe/play/play-docs_2.12/2.6.6/play-docs_2.12-2.6.6.jar ...
19-Oct-2017 08:58:18 [info]         [SUCCESSFUL ] com.typesafe.play#play-docs_2.12;2.6.6!play-docs_2.12.jar (457ms)
19-Oct-2017 08:58:18 [info] downloading https://repo1.maven.org/maven2/com/typesafe/play/play-doc_2.12/1.8.1/play-doc_2.12-1.8.1.jar ...
19-Oct-2017 08:58:18 [info]         [SUCCESSFUL ] com.typesafe.play#play-doc_2.12;1.8.1!play-doc_2.12.jar (27ms)
19-Oct-2017 08:58:18 [info] downloading https://repo1.maven.org/maven2/org/pegdown/pegdown/1.6.0/pegdown-1.6.0.jar ...
19-Oct-2017 08:58:18 [info]         [SUCCESSFUL ] org.pegdown#pegdown;1.6.0!pegdown.jar (22ms)
19-Oct-2017 08:58:18 [info] Done updating.
19-Oct-2017 08:58:18 [warn] Found version conflict(s) in library dependencies; some are suspected to be binary incompatible:
19-Oct-2017 08:58:18 [warn]         * com.google.guava:guava:22.0 is selected over 19.0
19-Oct-2017 08:58:18 [warn]             +- com.typesafe.play:play_2.12:2.6.6                  (depends on 22.0)
19-Oct-2017 08:58:18 [warn]             +- com.google.inject:guice:4.1.0                      (depends on 19.0)
19-Oct-2017 08:58:18 [warn]         * com.typesafe.akka:akka-stream_2.12:2.5.4 is selected over 2.4.19
19-Oct-2017 08:58:18 [warn]             +- com.typesafe.play:play-streams_2.12:2.6.6          (depends on 2.5.4)
19-Oct-2017 08:58:18 [warn]             +- com.typesafe.akka:akka-http-core_2.12:10.0.10      (depends on 2.4.19)
19-Oct-2017 08:58:18 [warn]         * com.typesafe.akka:akka-actor_2.12:2.5.4 is selected over {2.4.14, 2.4.19}
19-Oct-2017 08:58:18 [warn]             +- com.typesafe.akka:akka-slf4j_2.12:2.5.4            (depends on 2.5.4)
19-Oct-2017 08:58:18 [warn]             +- com.typesafe.play:play_2.12:2.6.6                  (depends on 2.5.4)
19-Oct-2017 08:58:18 [warn]             +- com.typesafe.akka:akka-stream_2.12:2.5.4           (depends on 2.5.4)
19-Oct-2017 08:58:18 [warn]             +- com.typesafe.akka:akka-parsing_2.12:10.0.10        (depends on 2.4.19)
19-Oct-2017 08:58:18 [warn]             +- org.reactivemongo:reactivemongo_2.12:0.12.6 ()     (depends on 2.4.14)
19-Oct-2017 08:58:18 [warn] Run 'evicted' to see detailed eviction warnings
19-Oct-2017 08:58:18 [success] Total time: 17 s, completed Oct 19, 2017 8:58:18 AM
19-Oct-2017 08:58:18 [INFO] [10/19/2017 08:58:18.554] [Thread-2] [CoordinatedShutdown(akka://sbt-web)] Starting coordinated shutdown from JVM shutdown hook
19-Oct-2017 08:58:18 Finished task 'clean update' with result: Success
19-Oct-2017 08:58:18 Starting task 'compile' of type 'com.atlassian.bamboo.plugins.scripttask:task.builder.command'
19-Oct-2017 08:58:18
Beginning to execute external process for build 'BrownDog - Tool Catalog - feature-BD-1801-spike-investigate-upgrading-tools - Default Job #2 (BD-TC90-JOB1-2)'
... running command line:
/home/bamboo/sbt-0.13.2/bin/sbt compile
... in: /home/bamboo/bamboo-agent-home/xml-data/build-dir/BD-TC90-JOB1
... using extra environment variables:
bamboo_planRepository_1_branch=feature/BD-1801-spike-investigate-upgrading-tools
bamboo_capability_system_builder_node_Node_js_v6_9_1=/home/bamboo/node-v6.9.1/bin/node
bamboo_capability_system_builder_command_npm_6=/home/bamboo/node-v6.9.1/bin/npm
bamboo_capability_system_builder_command_buckminster_4_3=/home/bamboo/buckminster-4.3/buckminster
bamboo_repository_150601740_name=tools-catalog
bamboo_capability_system_builder_command_buckminster_4_2=/home/bamboo/buckminster-4.2/buckminster
bamboo_repository_150601740_git_username=
bamboo_planRepository_1_branchDisplayName=feature/BD-1801-spike-investigate-upgrading-tools
bamboo_repository_revision_number=7c408ba5bc8f5eb0016eab55afa7724184f29c75
bamboo_resultsUrl=https://opensource.ncsa.illinois.edu/bamboo/browse/BD-TC90-JOB1-2
bamboo_capability_system_builder_command_sphinx=/usr/bin/sphinx-build
bamboo_planRepository_1_name=tools-catalog
bamboo_build_working_directory=/home/bamboo/bamboo-agent-home/xml-data/build-dir/BD-TC90-JOB1
bamboo_buildKey=BD-TC90-JOB1
bamboo_capability_system_os=linux
bamboo_shortPlanName=feature-BD-1801-spike-investigate-upgrading-tools
bamboo_planRepository_name=tools-catalog
bamboo_buildNumber=2
bamboo_shortJobName=Default Job
bamboo_buildResultsUrl=https://opensource.ncsa.illinois.edu/bamboo/browse/BD-TC90-JOB1-2
bamboo_planRepository_repositoryUrl=ssh://git@opensource.ncsa.illinois.edu:7999/bd/tools-catalog.git
bamboo_agentId=143032321
bamboo_planName=BrownDog - Tool Catalog - feature-BD-1801-spike-investigate-upgrading-tools
bamboo_repository_150601740_branch_name=feature/BD-1801-spike-investigate-upgrading-tools
bamboo_shortPlanKey=TC90
bamboo_capability_system_builder_command_sbt_0_13=/home/bamboo/sbt-0.13.2/bin/sbt
bamboo_shortJobKey=JOB1
bamboo_capability_system_builder_node_Node_js_v0_10_28=/home/bamboo/node-v0.10.28/bin/node
bamboo_repository_150601740_git_branch=feature/BD-1801-spike-investigate-upgrading-tools
bamboo_repository_150601740_git_repositoryUrl=ssh://git@opensource.ncsa.illinois.edu:7999/bd/tools-catalog.git
bamboo_planRepository_revision=7c408ba5bc8f5eb0016eab55afa7724184f29c75
bamboo_repository_previous_revision_number=891fa10ebe7602690af47b153f8cc67b9dbe1b7a
bamboo_buildTimeStamp=2017-10-19T08:56:07.537-05:00
bamboo_capability_system_builder_command_npm=/home/bamboo/node-v0.10.28/bin/npm
bamboo_repository_150601740_revision_number=7c408ba5bc8f5eb0016eab55afa7724184f29c75
bamboo_planRepository_previousRevision=891fa10ebe7602690af47b153f8cc67b9dbe1b7a
bamboo_capability_system_builder_mvn2_Maven_2=/home/bamboo/apache-maven-2.2.1
bamboo_buildResultKey=BD-TC90-JOB1-2
bamboo_repository_git_branch=feature/BD-1801-spike-investigate-upgrading-tools
bamboo_repository_branch_name=feature/BD-1801-spike-investigate-upgrading-tools
bamboo_buildPlanName=BrownDog - Tool Catalog - feature-BD-1801-spike-investigate-upgrading-tools - Default Job
bamboo_planRepository_1_revision=7c408ba5bc8f5eb0016eab55afa7724184f29c75
bamboo_capability_system_builder_command_python3=/usr/bin/python3
bamboo_repository_name=tools-catalog
bamboo_repository_150601740_previous_revision_number=891fa10ebe7602690af47b153f8cc67b9dbe1b7a
bamboo_buildFailed=false
bamboo_capability_system_docker_executable=/usr/bin/docker
bamboo_capability_system_builder_command_grunt=/home/bamboo/node-v0.10.28/bin/grunt
bamboo_planRepository_branch=feature/BD-1801-spike-investigate-upgrading-tools
bamboo_agentWorkingDirectory=/home/bamboo/bamboo-agent-home/xml-data/build-dir
bamboo_capability_system_git_executable=/usr/bin/git
bamboo_planRepository_1_previousRevision=891fa10ebe7602690af47b153f8cc67b9dbe1b7a
bamboo_repository_git_username=
bamboo_capability_system_builder_sbt_SBT_0_13_13=/home/bamboo/sbt-0.13.13
bamboo_planRepository_branchDisplayName=feature/BD-1801-spike-investigate-upgrading-tools
bamboo_capability_system_builder_command_phantomjs=/home/bamboo/phantomjs-1.9.8/bin/phantomjs
bamboo_planRepository_1_type=bbserver
bamboo_planRepository_branchName=feature/BD-1801-spike-investigate-upgrading-tools
bamboo_capability_system_builder_command_python2_7=/usr/bin/python2.7
bamboo_capability_system_hostname=buildserver-1
bamboo_capability_system_jdk_JDK=/home/bamboo/jdk1.8.0_66
bamboo_capability_system_software_mongo=/usr/bin/mongo
bamboo_plan_storageTag=plan-150405143
bamboo_capability_system_software_rabbitmq=/usr/sbin/rabbitmqctl
bamboo_capability_system_builder_command_casperjs=/home/bamboo/node-v0.10.28/bin/casperjs
bamboo_planRepository_type=bbserver
bamboo_planRepository_1_username=
bamboo_capability_system_jdk_JDK_1_8_0_66=/home/bamboo/jdk1.8.0_66
bamboo_repository_git_repositoryUrl=ssh://git@opensource.ncsa.illinois.edu:7999/bd/tools-catalog.git
bamboo_capability_system_builder_node_Node_js=/home/bamboo/node-v0.10.28/bin/node
bamboo_capability_system_builder_ant_Ant=/home/bamboo/apache-ant-1.9.4
bamboo_capability_system_builder_mvn3_Maven_3=/home/bamboo/apache-maven-3.3.9
bamboo_working_directory=/home/bamboo/bamboo-agent-home/xml-data/build-dir/BD-TC90-JOB1
bamboo_planKey=BD-TC90
bamboo_build_commandline_com_atlassian_bamboo_plugins_scripttask_task_builder_command_2=/home/bamboo/sbt-0.13.2/bin/sbt clean update
bamboo_planRepository_1_repositoryUrl=ssh://git@opensource.ncsa.illinois.edu:7999/bd/tools-catalog.git
bamboo_planRepository_username=
bamboo_capability_system_jdk_JDK_1_8=/home/bamboo/jdk1.8.0_66
bamboo_capability_system_jdk_JDK_1_6=/home/bamboo/jdk1.6.0_41
bamboo_capability_system_builder_command_mkcrx=/home/bamboo/mkcrx/mkcrx.sh
bamboo_capability_system_jdk_JDK_1_7=/home/bamboo/jdk1.7.0_60
bamboo_planRepository_1_branchName=feature/BD-1801-spike-investigate-upgrading-tools
19-Oct-2017 08:58:18 Java HotSpot(TM) 64-Bit Server VM warning: ignoring option MaxPermSize=384M; support was removed in 8.0
19-Oct-2017 08:58:22 [info] Loading settings from plugins.sbt ...
19-Oct-2017 08:58:22 [info] Loading project definition from /home/bamboo/bamboo-agent-home/xml-data/build-dir/BD-TC90-JOB1/project
19-Oct-2017 08:58:25 [info] Loading settings from build.sbt ...
19-Oct-2017 08:58:25 [info] Set current project to tools-catalog (in build file:/home/bamboo/bamboo-agent-home/xml-data/build-dir/BD-TC90-JOB1/)
19-Oct-2017 08:58:26 [info] Executing in batch mode. For better performance use sbt's shell
19-Oct-2017 08:58:27 [info] Compiling 58 Scala sources and 1 Java source to /home/bamboo/bamboo-agent-home/xml-data/build-dir/BD-TC90-JOB1/target/scala-2.12/classes ...
19-Oct-2017 08:58:28 [info] Non-compiled module 'compiler-bridge_2.12' for Scala 2.12.2. Compiling...
19-Oct-2017 08:58:37 [info]   Compilation completed in 8.605s.
19-Oct-2017 08:58:37 [error] /home/bamboo/bamboo-agent-home/xml-data/build-dir/BD-TC90-JOB1/app/controllers/Auth.scala:10:22: object ws is not a member of package play.api.libs
19-Oct-2017 08:58:37 [error] import play.api.libs.ws.{WS, _}
19-Oct-2017 08:58:37 [error]                      ^
19-Oct-2017 08:58:37 [error] /home/bamboo/bamboo-agent-home/xml-data/build-dir/BD-TC90-JOB1/app/controllers/Application.scala:22:8: object Routes is not a member of package play.api
19-Oct-2017 08:58:37 [error] import play.api.{Logger, Play, Routes} // "Play" is for getting config values.
19-Oct-2017 08:58:37 [error]        ^
19-Oct-2017 08:58:37 [error] /home/bamboo/bamboo-agent-home/xml-data/build-dir/BD-TC90-JOB1/app/controllers/Application.scala:24:13: object modules is not a member of package play
19-Oct-2017 08:58:37 [error] import play.modules.reactivemongo.MongoController
19-Oct-2017 08:58:37 [error]             ^
19-Oct-2017 08:58:37 [error] /home/bamboo/bamboo-agent-home/xml-data/build-dir/BD-TC90-JOB1/app/controllers/Application.scala:26:15: object twitterBootstrap is not a member of package views.html.helper
19-Oct-2017 08:58:37 [error] import helper.twitterBootstrap._
19-Oct-2017 08:58:37 [error]               ^
19-Oct-2017 08:58:37 [error] /home/bamboo/bamboo-agent-home/xml-data/build-dir/BD-TC90-JOB1/app/controllers/Application.scala:29:27: object mail is not a member of package org.apache.commons
19-Oct-2017 08:58:37 [error] import org.apache.commons.mail._
19-Oct-2017 08:58:37 [error]                           ^
19-Oct-2017 08:58:37 [error] /home/bamboo/bamboo-agent-home/xml-data/build-dir/BD-TC90-JOB1/app/controllers/Application.scala:34:38: object default is not a member of package reactivemongo.api.collections
19-Oct-2017 08:58:37 [error] import reactivemongo.api.collections.default.BSONCollection
19-Oct-2017 08:58:37 [error]                                      ^
19-Oct-2017 08:58:37 [error] /home/bamboo/bamboo-agent-home/xml-data/build-dir/BD-TC90-JOB1/app/controllers/Application.scala:50:44: not found: type MongoController
19-Oct-2017 08:58:37 [error] object Application extends Controller with MongoController with Secured {
19-Oct-2017 08:58:37 [error]                                            ^
19-Oct-2017 08:58:37 [error] /home/bamboo/bamboo-agent-home/xml-data/build-dir/BD-TC90-JOB1/app/controllers/Application.scala:54:18: not found: value db
19-Oct-2017 08:58:37 [error]   val toolsCol = db[BSONCollection]("tools")
19-Oct-2017 08:58:37 [error]                  ^
19-Oct-2017 08:58:37 [error] /home/bamboo/bamboo-agent-home/xml-data/build-dir/BD-TC90-JOB1/app/controllers/Application.scala:54:21: not found: type BSONCollection
19-Oct-2017 08:58:37 [error]   val toolsCol = db[BSONCollection]("tools")
19-Oct-2017 08:58:37 [error]                     ^
19-Oct-2017 08:58:37 [error] /home/bamboo/bamboo-agent-home/xml-data/build-dir/BD-TC90-JOB1/app/controllers/Application.scala:55:25: not found: value db
19-Oct-2017 08:58:37 [error]   val toolVersionsCol = db[BSONCollection]("tool_versions")
19-Oct-2017 08:58:37 [error]                         ^
19-Oct-2017 08:58:37 [error] /home/bamboo/bamboo-agent-home/xml-data/build-dir/BD-TC90-JOB1/app/controllers/Application.scala:55:28: not found: type BSONCollection
19-Oct-2017 08:58:37 [error]   val toolVersionsCol = db[BSONCollection]("tool_versions")
19-Oct-2017 08:58:37 [error]                            ^
19-Oct-2017 08:58:37 [error] /home/bamboo/bamboo-agent-home/xml-data/build-dir/BD-TC90-JOB1/app/controllers/Application.scala:56:27: not found: value db
19-Oct-2017 08:58:37 [error]   val deploymentMsgsCol = db[BSONCollection]("deploy_msg_log")
19-Oct-2017 08:58:37 [error]                           ^
19-Oct-2017 08:58:37 [error] /home/bamboo/bamboo-agent-home/xml-data/build-dir/BD-TC90-JOB1/app/controllers/Application.scala:56:30: not found: type BSONCollection
19-Oct-2017 08:58:37 [error]   val deploymentMsgsCol = db[BSONCollection]("deploy_msg_log")
19-Oct-2017 08:58:37 [error]                              ^
19-Oct-2017 08:58:37 [error] /home/bamboo/bamboo-agent-home/xml-data/build-dir/BD-TC90-JOB1/app/controllers/Application.scala:59:27: not found: value db
19-Oct-2017 08:58:37 [error]   val gridFS = new GridFS(db, file_GridFS_prefix)
19-Oct-2017 08:58:37 [error]                           ^
19-Oct-2017 08:58:37 [error] /home/bamboo/bamboo-agent-home/xml-data/build-dir/BD-TC90-JOB1/app/controllers/Application.scala:60:31: not found: value db
19-Oct-2017 08:58:37 [error]   val gridFSIcon = new GridFS(db, "icons")
19-Oct-2017 08:58:37 [error]                               ^
19-Oct-2017 08:58:37 [error] /home/bamboo/bamboo-agent-home/xml-data/build-dir/BD-TC90-JOB1/app/controllers/Application.scala:75:7: not found: value driver
19-Oct-2017 08:58:37 [error]       driver.connection(parsedUri)
19-Oct-2017 08:58:37 [error]       ^
19-Oct-2017 08:58:37 [error] /home/bamboo/bamboo-agent-home/xml-data/build-dir/BD-TC90-JOB1/app/controllers/Application.scala:78:50: not found: type BSONCollection
19-Oct-2017 08:58:37 [error]   val cloudVMCol = elasticityDatabase.collection[BSONCollection]("cloud_vm")
19-Oct-2017 08:58:37 [error]                                                  ^
19-Oct-2017 08:58:37 [error] /home/bamboo/bamboo-agent-home/xml-data/build-dir/BD-TC90-JOB1/app/controllers/Application.scala:79:50: not found: type BSONCollection
19-Oct-2017 08:58:37 [error]   val vmInfoColl = elasticityDatabase.collection[BSONCollection]("vm_info")
19-Oct-2017 08:58:37 [error]                                                  ^
19-Oct-2017 08:58:37 [error] /home/bamboo/bamboo-agent-home/xml-data/build-dir/BD-TC90-JOB1/app/controllers/Application.scala:80:48: not found: type BSONCollection
19-Oct-2017 08:58:37 [error]   val extrColl = elasticityDatabase.collection[BSONCollection]("extr")
19-Oct-2017 08:58:37 [error]                                                ^
19-Oct-2017 08:58:37 [error] /home/bamboo/bamboo-agent-home/xml-data/build-dir/BD-TC90-JOB1/app/controllers/Application.scala:81:50: not found: type BSONCollection
19-Oct-2017 08:58:37 [error]   val vm2etsColl = elasticityDatabase.collection[BSONCollection]("vm2ets")
19-Oct-2017 08:58:37 [error]                                                  ^
19-Oct-2017 08:58:37 [error] /home/bamboo/bamboo-agent-home/xml-data/build-dir/BD-TC90-JOB1/app/controllers/Application.scala:1768:56: wrong number of type arguments for reactivemongo.api.gridfs.ReadFile, should be 2
19-Oct-2017 08:58:37 [error]     var fileMap : Map[String, reactivemongo.api.gridfs.ReadFile[reactivemongo.bson.BSONValue]] = Map()
19-Oct-2017 08:58:37 [error]                                                        ^
19-Oct-2017 08:58:37 [error] /home/bamboo/bamboo-agent-home/xml-data/build-dir/BD-TC90-JOB1/app/controllers/Auth.scala:200:51: wrong number of type arguments for play.api.mvc.ActionBuilder, should be 2
19-Oct-2017 08:58:37 [error]     def WithRole(rscid: String, role: Role) = new ActionBuilder[UserRequest] {
19-Oct-2017 08:58:37 [error]                                                   ^
19-Oct-2017 08:58:37 [error] /home/bamboo/bamboo-agent-home/xml-data/build-dir/BD-TC90-JOB1/app/controllers/Auth.scala:201:81: not found: type SimpleResult
19-Oct-2017 08:58:37 [error]       def invokeBlock[A](request: Request[A], block: (UserRequest[A]) => Future[SimpleResult]) = {
19-Oct-2017 08:58:37 [error]                                                                                 ^
19-Oct-2017 08:58:38 [error] /home/bamboo/bamboo-agent-home/xml-data/build-dir/BD-TC90-JOB1/app/services/mongodb/MongoUserService.scala:13:12: object mongodb is not a member of package com
19-Oct-2017 08:58:38 [error] import com.mongodb.casbah.Imports._  // MongoDBObject, WriteConcern, ...
19-Oct-2017 08:58:38 [error]            ^
19-Oct-2017 08:58:38 [error] /home/bamboo/bamboo-agent-home/xml-data/build-dir/BD-TC90-JOB1/app/services/mongodb/MongoUserService.scala:14:12: object novus is not a member of package com
19-Oct-2017 08:58:38 [error] import com.novus.salat.dao.{SalatDAO, ModelCompanion}
19-Oct-2017 08:58:38 [error]            ^
19-Oct-2017 08:58:38 [error] /home/bamboo/bamboo-agent-home/xml-data/build-dir/BD-TC90-JOB1/app/services/mongodb/MongoUserService.scala:50:29: not found: type ModelCompanion
19-Oct-2017 08:58:38 [error] object AppConfigDAO extends ModelCompanion[UriInfo, ObjectId] {
19-Oct-2017 08:58:38 [error]                             ^
19-Oct-2017 08:58:38 [error] /home/bamboo/bamboo-agent-home/xml-data/build-dir/BD-TC90-JOB1/app/controllers/Auth.scala:168:29: wrong number of type arguments for play.api.mvc.ActionBuilder, should be 2
19-Oct-2017 08:58:38 [error]     def SecuredAction = new ActionBuilder[UserRequest] {
19-Oct-2017 08:58:38 [error]                             ^
19-Oct-2017 08:58:38 [error] /home/bamboo/bamboo-agent-home/xml-data/build-dir/BD-TC90-JOB1/app/controllers/Auth.scala:169:81: not found: type SimpleResult
19-Oct-2017 08:58:38 [error]       def invokeBlock[A](request: Request[A], block: (UserRequest[A]) => Future[SimpleResult]) = {
19-Oct-2017 08:58:38 [error]                                                                                 ^
19-Oct-2017 08:58:38 [error] /home/bamboo/bamboo-agent-home/xml-data/build-dir/BD-TC90-JOB1/app/controllers/Application.scala:545:54: not found: value db
19-Oct-2017 08:58:38 [error]       clusterConfigOpt <- ClusterConfigDAO.getByName(db, deployRequest.clusterName)
19-Oct-2017 08:58:38 [error]                                                      ^
19-Oct-2017 08:58:38 [error] /home/bamboo/bamboo-agent-home/xml-data/build-dir/BD-TC90-JOB1/app/controllers/Application.scala:549:81: type mismatch;
19-Oct-2017 08:58:38 [error]  found   : Any
19-Oct-2017 08:58:38 [error]  required: models.ClusterConfig
19-Oct-2017 08:58:38 [error]           val dockerParamsTry = DeploymentRequest.toDeployParams(deployRequest, clusterConfig)
19-Oct-2017 08:58:38 [error]                                                                                 ^
19-Oct-2017 08:58:38 [error] /home/bamboo/bamboo-agent-home/xml-data/build-dir/BD-TC90-JOB1/app/controllers/Application.scala:552:72: value swarmURI is not a member of Any
19-Oct-2017 08:58:38 [error]             case Success(dockerParams) => BDSwarm.deploy(clusterConfig.swarmURI, dockerParams)
19-Oct-2017 08:58:38 [error]                                                                        ^
19-Oct-2017 08:58:38 [error] /home/bamboo/bamboo-agent-home/xml-data/build-dir/BD-TC90-JOB1/app/controllers/Application.scala:552:82: type mismatch;
19-Oct-2017 08:58:38 [error]  found   : Any
19-Oct-2017 08:58:38 [error]  required: services.BDSwarm.DeployParams
19-Oct-2017 08:58:38 [error]             case Success(dockerParams) => BDSwarm.deploy(clusterConfig.swarmURI, dockerParams)
19-Oct-2017 08:58:38 [error]                                                                                  ^
19-Oct-2017 08:58:38 [error] /home/bamboo/bamboo-agent-home/xml-data/build-dir/BD-TC90-JOB1/app/controllers/Application.scala:568:54: not found: value db
19-Oct-2017 08:58:38 [error]       clusterConfigOpt <- ClusterConfigDAO.getByName(db, stopRequest.clusterName);
19-Oct-2017 08:58:38 [error]                                                      ^
19-Oct-2017 08:58:38 [error] /home/bamboo/bamboo-agent-home/xml-data/build-dir/BD-TC90-JOB1/app/controllers/Application.scala:573:38: value swarmURI is not a member of Any
19-Oct-2017 08:58:38 [error]           BDSwarm.stop(clusterConfig.swarmURI, serviceName)
19-Oct-2017 08:58:38 [error]                                      ^
19-Oct-2017 08:58:38 [error] /home/bamboo/bamboo-agent-home/xml-data/build-dir/BD-TC90-JOB1/app/controllers/Application.scala:573:48: type mismatch;
19-Oct-2017 08:58:38 [error]  found   : Any
19-Oct-2017 08:58:38 [error]  required: String
19-Oct-2017 08:58:38 [error]           BDSwarm.stop(clusterConfig.swarmURI, serviceName)
19-Oct-2017 08:58:38 [error]                                                ^
19-Oct-2017 08:58:38 [error] /home/bamboo/bamboo-agent-home/xml-data/build-dir/BD-TC90-JOB1/app/controllers/Auth.scala:184:31: wrong number of type arguments for play.api.mvc.ActionBuilder, should be 2
19-Oct-2017 08:58:38 [error]     def UserAwareAction = new ActionBuilder[UserOptionRequest] {
19-Oct-2017 08:58:38 [error]                               ^
19-Oct-2017 08:58:38 [error] /home/bamboo/bamboo-agent-home/xml-data/build-dir/BD-TC90-JOB1/app/controllers/Auth.scala:185:87: not found: type SimpleResult
19-Oct-2017 08:58:38 [error]       def invokeBlock[A](request: Request[A], block: (UserOptionRequest[A]) => Future[SimpleResult]) = {
19-Oct-2017 08:58:38 [error]                                                                                       ^
19-Oct-2017 08:58:38 [error] /home/bamboo/bamboo-agent-home/xml-data/build-dir/BD-TC90-JOB1/app/controllers/Application.scala:621:43: type mismatch;
19-Oct-2017 08:58:38 [error]  found   : <error>{def invokeBlock[A](request: play.api.mvc.Request[A],block: controllers.Application.UserOptionRequest[A] => scala.concurrent.Future[<error>]): scala.concurrent.Future[<error>]}
19-Oct-2017 08:58:38 [error]  required: ?{def apply: ?}
19-Oct-2017 08:58:38 [error] Note that implicit conversions are not applicable because they are ambiguous:
19-Oct-2017 08:58:38 [error]  both method augmentString in object Predef of type (x: String)scala.collection.immutable.StringOps
19-Oct-2017 08:58:38 [error]  and method booleanArrayOps in object Predef of type (xs: Array[Boolean])scala.collection.mutable.ArrayOps.ofBoolean
19-Oct-2017 08:58:38 [error]  are possible conversion functions from <error>{def invokeBlock[A](request: play.api.mvc.Request[A],block: controllers.Application.UserOptionRequest[A] => scala.concurrent.Future[<error>]): scala.concurrent.Future[<error>]} to ?{def apply: ?}
19-Oct-2017 08:58:38 [error]   def redirectToExternalURL(url:String) = UserAwareAction { implicit request =>
19-Oct-2017 08:58:38 [error]                                           ^
19-Oct-2017 08:58:38 [error] /home/bamboo/bamboo-agent-home/xml-data/build-dir/BD-TC90-JOB1/app/controllers/Application.scala:621:59: <error>{def invokeBlock[A](request: play.api.mvc.Request[A],block: controllers.Application.UserOptionRequest[A] => scala.concurrent.Future[<error>]): scala.concurrent.Future[<error>]} does not take parameters
19-Oct-2017 08:58:38 [error]   def redirectToExternalURL(url:String) = UserAwareAction { implicit request =>
19-Oct-2017 08:58:38 [error]                                                           ^
19-Oct-2017 08:58:38 [error] /home/bamboo/bamboo-agent-home/xml-data/build-dir/BD-TC90-JOB1/app/controllers/Application.scala:790:30: type mismatch;
19-Oct-2017 08:58:38 [error]  found   : <error>{def invokeBlock[A](request: play.api.mvc.Request[A],block: controllers.Application.UserRequest[A] => scala.concurrent.Future[<error>]): scala.concurrent.Future[<error>]}
19-Oct-2017 08:58:38 [error]  required: ?{def apply: ?}
19-Oct-2017 08:58:38 [error] Note that implicit conversions are not applicable because they are ambiguous:
19-Oct-2017 08:58:38 [error]  both method booleanArrayOps in object Predef of type (xs: Array[Boolean])scala.collection.mutable.ArrayOps.ofBoolean
19-Oct-2017 08:58:38 [error]  and method byteArrayOps in object Predef of type (xs: Array[Byte])scala.collection.mutable.ArrayOps.ofByte
19-Oct-2017 08:58:38 [error]  are possible conversion functions from <error>{def invokeBlock[A](request: play.api.mvc.Request[A],block: controllers.Application.UserRequest[A] => scala.concurrent.Future[<error>]): scala.concurrent.Future[<error>]} to ?{def apply: ?}
19-Oct-2017 08:58:38 [error]   def showCreateToolForm() = SecuredAction { implicit request =>
19-Oct-2017 08:58:38 [error]                              ^
19-Oct-2017 08:58:38 [error] /home/bamboo/bamboo-agent-home/xml-data/build-dir/BD-TC90-JOB1/app/views/editTool.scala.html:1:1: wrong number of type arguments for reactivemongo.api.gridfs.ReadFile, should be 2
19-Oct-2017 08:58:38 [error] @(id: Option[String], form: Form[models.Tool], icon: Option[reactivemongo.api.gridfs.ReadFile[reactivemongo.bson.BSONValue]])(implicit user: Option[Identity] = None)
19-Oct-2017 08:58:38 [error] ^
19-Oct-2017 08:58:38 [error] /home/bamboo/bamboo-agent-home/xml-data/build-dir/BD-TC90-JOB1/app/views/editTool.scala.html:1:86: wrong number of type arguments for reactivemongo.api.gridfs.ReadFile, should be 2
19-Oct-2017 08:58:38 [error] @(id: Option[String], form: Form[models.Tool], icon: Option[reactivemongo.api.gridfs.ReadFile[reactivemongo.bson.BSONValue]])(implicit user: Option[Identity] = None)
19-Oct-2017 08:58:38 [error]                                                                                      ^
19-Oct-2017 08:58:38 [error] /home/bamboo/bamboo-agent-home/xml-data/build-dir/BD-TC90-JOB1/app/models/Tool.scala:157:18: constructor BSONObjectID in class BSONObjectID cannot be accessed in object Tool
19-Oct-2017 08:58:38 [error]           id.map(new BSONObjectID(_).stringify),
19-Oct-2017 08:58:38 [error]                  ^
19-Oct-2017 08:58:38 [error] /home/bamboo/bamboo-agent-home/xml-data/build-dir/BD-TC90-JOB1/app/controllers/Application.scala:790:44: <error>{def invokeBlock[A](request: play.api.mvc.Request[A],block: controllers.Application.UserRequest[A] => scala.concurrent.Future[<error>]): scala.concurrent.Future[<error>]} does not take parameters
19-Oct-2017 08:58:38 [error]   def showCreateToolForm() = SecuredAction { implicit request =>
19-Oct-2017 08:58:38 [error]                                            ^
19-Oct-2017 08:58:38 [error] /home/bamboo/bamboo-agent-home/xml-data/build-dir/BD-TC90-JOB1/app/controllers/Application.scala:936:28: not found: value serve
19-Oct-2017 08:58:38 [error]       case Some("true") => serve(gridFSIcon, file, CONTENT_DISPOSITION_INLINE)
19-Oct-2017 08:58:38 [error]                            ^
19-Oct-2017 08:58:38 [error] /home/bamboo/bamboo-agent-home/xml-data/build-dir/BD-TC90-JOB1/app/controllers/Application.scala:936:52: not found: value CONTENT_DISPOSITION_INLINE
19-Oct-2017 08:58:38 [error]       case Some("true") => serve(gridFSIcon, file, CONTENT_DISPOSITION_INLINE)
19-Oct-2017 08:58:38 [error]                                                    ^
19-Oct-2017 08:58:38 [error] /home/bamboo/bamboo-agent-home/xml-data/build-dir/BD-TC90-JOB1/app/controllers/Application.scala:937:28: not found: value serve
19-Oct-2017 08:58:38 [error]       case _            => serve(gridFSIcon, file)
19-Oct-2017 08:58:38 [error]                            ^
19-Oct-2017 08:58:38 [error] /home/bamboo/bamboo-agent-home/xml-data/build-dir/BD-TC90-JOB1/app/controllers/Application.scala:1004:94: wrong number of type arguments for reactivemongo.api.gridfs.ReadFile, should be 2
19-Oct-2017 08:58:38 [error]   private def discardUploadedFileRequest(maybeFile: Option[MultipartFormData.FilePart[Future[ReadFile[BSONValue]]]]){
19-Oct-2017 08:58:38 [error]                                                                                              ^
19-Oct-2017 08:58:38 [error] /home/bamboo/bamboo-agent-home/xml-data/build-dir/BD-TC90-JOB1/app/controllers/Application.scala:1042:51: wrong number of type arguments for reactivemongo.api.gridfs.ReadFile, should be 2
19-Oct-2017 08:58:38 [error]   private def addMetadataToFile(maybeFile: Future[ReadFile[BSONValue]], fileType: String, toolVersionId: String):Future[Boolean] = {
19-Oct-2017 08:58:38 [error]                                                   ^
19-Oct-2017 08:58:38 [error] /home/bamboo/bamboo-agent-home/xml-data/build-dir/BD-TC90-JOB1/app/controllers/Application.scala:1303:57: wrong number of type arguments for reactivemongo.api.gridfs.ReadFile, should be 2
19-Oct-2017 08:58:38 [error]   private def sortByFiletype(fileWithIdTuple1: (String, ReadFile[BSONValue]), fileWithIdTuple2: (String, ReadFile[BSONValue])) = {
19-Oct-2017 08:58:38 [error]                                                         ^
19-Oct-2017 08:58:38 [error] /home/bamboo/bamboo-agent-home/xml-data/build-dir/BD-TC90-JOB1/app/controllers/Application.scala:1303:106: wrong number of type arguments for reactivemongo.api.gridfs.ReadFile, should be 2
19-Oct-2017 08:58:38 [error]   private def sortByFiletype(fileWithIdTuple1: (String, ReadFile[BSONValue]), fileWithIdTuple2: (String, ReadFile[BSONValue])) = {
19-Oct-2017 08:58:38 [error]                                                                                                          ^
19-Oct-2017 08:58:38 [error] /home/bamboo/bamboo-agent-home/xml-data/build-dir/BD-TC90-JOB1/app/controllers/Application.scala:1445:55: wrong number of type arguments for reactivemongo.api.gridfs.ReadFile, should be 2
19-Oct-2017 08:58:38 [error]   private def fileSaveHelperSuccess(maybeFile: Future[ReadFile[BSONValue]], fileType: String, toolVersionId: String): Future[Boolean] = {
19-Oct-2017 08:58:38 [error]                                                       ^
19-Oct-2017 08:58:38 [error] /home/bamboo/bamboo-agent-home/xml-data/build-dir/BD-TC90-JOB1/app/controllers/Application.scala:1525:54: type mismatch;
19-Oct-2017 08:58:38 [error]  found   : <error>{def invokeBlock[A](request: play.api.mvc.Request[A],block: controllers.Application.UserRequest[A] => scala.concurrent.Future[<error>]): scala.concurrent.Future[<error>]}
19-Oct-2017 08:58:38 [error]  required: ?{def apply: ?}
19-Oct-2017 08:58:38 [error] Note that implicit conversions are not applicable because they are ambiguous:
19-Oct-2017 08:58:38 [error]  both method booleanArrayOps in object Predef of type (xs: Array[Boolean])scala.collection.mutable.ArrayOps.ofBoolean
19-Oct-2017 08:58:38 [error]  and method byteArrayOps in object Predef of type (xs: Array[Byte])scala.collection.mutable.ArrayOps.ofByte
19-Oct-2017 08:58:38 [error]  are possible conversion functions from <error>{def invokeBlock[A](request: play.api.mvc.Request[A],block: controllers.Application.UserRequest[A] => scala.concurrent.Future[<error>]): scala.concurrent.Future[<error>]} to ?{def apply: ?}
19-Oct-2017 08:58:38 [error]   def authorApproveToolVersion(id: String) = WithRole(id, Role_Author) { implicit request =>
19-Oct-2017 08:58:38 [error]                                                      ^
19-Oct-2017 08:58:38 [error] /home/bamboo/bamboo-agent-home/xml-data/build-dir/BD-TC90-JOB1/app/controllers/Application.scala:1525:72: <error>{def invokeBlock[A](request: play.api.mvc.Request[A],block: controllers.Application.UserRequest[A] => scala.concurrent.Future[<error>]): scala.concurrent.Future[<error>]} does not take parameters
19-Oct-2017 08:58:38 [error]   def authorApproveToolVersion(id: String) = WithRole(id, Role_Author) { implicit request =>
19-Oct-2017 08:58:38 [error]                                                                        ^
19-Oct-2017 08:58:38 [error] /home/bamboo/bamboo-agent-home/xml-data/build-dir/BD-TC90-JOB1/app/controllers/Application.scala:1534:53: type mismatch;
19-Oct-2017 08:58:38 [error]  found   : <error>{def invokeBlock[A](request: play.api.mvc.Request[A],block: controllers.Application.UserRequest[A] => scala.concurrent.Future[<error>]): scala.concurrent.Future[<error>]}
19-Oct-2017 08:58:38 [error]  required: ?{def apply: ?}
19-Oct-2017 08:58:38 [error] Note that implicit conversions are not applicable because they are ambiguous:
19-Oct-2017 08:58:38 [error]  both method booleanArrayOps in object Predef of type (xs: Array[Boolean])scala.collection.mutable.ArrayOps.ofBoolean
19-Oct-2017 08:58:38 [error]  and method byteArrayOps in object Predef of type (xs: Array[Byte])scala.collection.mutable.ArrayOps.ofByte
19-Oct-2017 08:58:38 [error]  are possible conversion functions from <error>{def invokeBlock[A](request: play.api.mvc.Request[A],block: controllers.Application.UserRequest[A] => scala.concurrent.Future[<error>]): scala.concurrent.Future[<error>]} to ?{def apply: ?}
19-Oct-2017 08:58:38 [error]   def authorRetireToolVersion(id: String) = WithRole(id, Role_Author) { implicit request =>
19-Oct-2017 08:58:38 [error]                                                     ^
19-Oct-2017 08:58:38 [error] /home/bamboo/bamboo-agent-home/xml-data/build-dir/BD-TC90-JOB1/app/controllers/Application.scala:1534:71: <error>{def invokeBlock[A](request: play.api.mvc.Request[A],block: controllers.Application.UserRequest[A] => scala.concurrent.Future[<error>]): scala.concurrent.Future[<error>]} does not take parameters
19-Oct-2017 08:58:38 [error]   def authorRetireToolVersion(id: String) = WithRole(id, Role_Author) { implicit request =>
19-Oct-2017 08:58:38 [error]                                                                       ^
19-Oct-2017 08:58:38 [error] /home/bamboo/bamboo-agent-home/xml-data/build-dir/BD-TC90-JOB1/app/controllers/Application.scala:1900:22: not found: type Email
19-Oct-2017 08:58:38 [error]     val commonsMail: Email = if(attachment.isDefined) {
19-Oct-2017 08:58:38 [error]                      ^
19-Oct-2017 08:58:38 [error] /home/bamboo/bamboo-agent-home/xml-data/build-dir/BD-TC90-JOB1/app/controllers/Application.scala:1901:29: not found: type EmailAttachment
19-Oct-2017 08:58:38 [error]       val attachment1 = new EmailAttachment()
19-Oct-2017 08:58:38 [error]                             ^
19-Oct-2017 08:58:38 [error] /home/bamboo/bamboo-agent-home/xml-data/build-dir/BD-TC90-JOB1/app/controllers/Application.scala:1905:11: not found: type MultiPartEmail
19-Oct-2017 08:58:38 [error]       new MultiPartEmail().attach(attachment1).setMsg(message)
19-Oct-2017 08:58:38 [error]           ^
19-Oct-2017 08:58:38 [error] /home/bamboo/bamboo-agent-home/xml-data/build-dir/BD-TC90-JOB1/app/controllers/Application.scala:1907:11: not found: type HtmlEmail
19-Oct-2017 08:58:38 [error]       new HtmlEmail().setHtmlMsg(richMessage.get).setTextMsg(message)
19-Oct-2017 08:58:38 [error]           ^
19-Oct-2017 08:58:38 [error] /home/bamboo/bamboo-agent-home/xml-data/build-dir/BD-TC90-JOB1/app/controllers/Application.scala:1909:11: not found: type SimpleEmail
19-Oct-2017 08:58:38 [error]       new SimpleEmail().setMsg(message)
19-Oct-2017 08:58:38 [error]           ^
19-Oct-2017 08:58:39 [error] /home/bamboo/bamboo-agent-home/xml-data/build-dir/BD-TC90-JOB1/app/controllers/Application.scala:1686:20: type mismatch;
19-Oct-2017 08:58:39 [error]  found   : <error>{def invokeBlock[A](request: play.api.mvc.Request[A],block: controllers.Application.UserOptionRequest[A] => scala.concurrent.Future[<error>]): scala.concurrent.Future[<error>]}
19-Oct-2017 08:58:39 [error]  required: ?{def apply: ?}
19-Oct-2017 08:58:39 [error] Note that implicit conversions are not applicable because they are ambiguous:
19-Oct-2017 08:58:39 [error]  both method booleanArrayOps in object Predef of type (xs: Array[Boolean])scala.collection.mutable.ArrayOps.ofBoolean
19-Oct-2017 08:58:39 [error]  and method byteArrayOps in object Predef of type (xs: Array[Byte])scala.collection.mutable.ArrayOps.ofByte
19-Oct-2017 08:58:39 [error]  are possible conversion functions from <error>{def invokeBlock[A](request: play.api.mvc.Request[A],block: controllers.Application.UserOptionRequest[A] => scala.concurrent.Future[<error>]): scala.concurrent.Future[<error>]} to ?{def apply: ?}
19-Oct-2017 08:58:39 [error]   def searchPage = UserAwareAction { implicit request =>
19-Oct-2017 08:58:39 [error]                    ^
19-Oct-2017 08:58:39 [error] /home/bamboo/bamboo-agent-home/xml-data/build-dir/BD-TC90-JOB1/app/controllers/Application.scala:1686:36: <error>{def invokeBlock[A](request: play.api.mvc.Request[A],block: controllers.Application.UserOptionRequest[A] => scala.concurrent.Future[<error>]): scala.concurrent.Future[<error>]} does not take parameters
19-Oct-2017 08:58:39 [error]   def searchPage = UserAwareAction { implicit request =>
19-Oct-2017 08:58:39 [error]                                    ^
19-Oct-2017 08:58:39 [error] /home/bamboo/bamboo-agent-home/xml-data/build-dir/BD-TC90-JOB1/app/controllers/Application.scala:1732:27: type mismatch;
19-Oct-2017 08:58:39 [error]  found   : <error>{def invokeBlock[A](request: play.api.mvc.Request[A],block: controllers.Application.UserRequest[A] => scala.concurrent.Future[<error>]): scala.concurrent.Future[<error>]}
19-Oct-2017 08:58:39 [error]  required: ?{def apply: ?}
19-Oct-2017 08:58:39 [error] Note that implicit conversions are not applicable because they are ambiguous:
19-Oct-2017 08:58:39 [error]  both method booleanArrayOps in object Predef of type (xs: Array[Boolean])scala.collection.mutable.ArrayOps.ofBoolean
19-Oct-2017 08:58:39 [error]  and method byteArrayOps in object Predef of type (xs: Array[Byte])scala.collection.mutable.ArrayOps.ofByte
19-Oct-2017 08:58:39 [error]  are possible conversion functions from <error>{def invokeBlock[A](request: play.api.mvc.Request[A],block: controllers.Application.UserRequest[A] => scala.concurrent.Future[<error>]): scala.concurrent.Future[<error>]} to ?{def apply: ?}
19-Oct-2017 08:58:39 [error]   def adminPage = WithRole("", Role_Admin) { implicit request =>
19-Oct-2017 08:58:39 [error]                           ^
19-Oct-2017 08:58:39 [error] /home/bamboo/bamboo-agent-home/xml-data/build-dir/BD-TC90-JOB1/app/controllers/Application.scala:1732:44: <error>{def invokeBlock[A](request: play.api.mvc.Request[A],block: controllers.Application.UserRequest[A] => scala.concurrent.Future[<error>]): scala.concurrent.Future[<error>]} does not take parameters
19-Oct-2017 08:58:39 [error]   def adminPage = WithRole("", Role_Admin) { implicit request =>
19-Oct-2017 08:58:39 [error]                                            ^
19-Oct-2017 08:58:39 [error] /home/bamboo/bamboo-agent-home/xml-data/build-dir/BD-TC90-JOB1/app/controllers/Application.scala:1737:36: type mismatch;
19-Oct-2017 08:58:39 [error]  found   : <error>{def invokeBlock[A](request: play.api.mvc.Request[A],block: controllers.Application.UserRequest[A] => scala.concurrent.Future[<error>]): scala.concurrent.Future[<error>]}
19-Oct-2017 08:58:39 [error]  required: ?{def apply: ?}
19-Oct-2017 08:58:39 [error] Note that implicit conversions are not applicable because they are ambiguous:
19-Oct-2017 08:58:39 [error]  both method booleanArrayOps in object Predef of type (xs: Array[Boolean])scala.collection.mutable.ArrayOps.ofBoolean
19-Oct-2017 08:58:39 [error]  and method byteArrayOps in object Predef of type (xs: Array[Byte])scala.collection.mutable.ArrayOps.ofByte
19-Oct-2017 08:58:39 [error]  are possible conversion functions from <error>{def invokeBlock[A](request: play.api.mvc.Request[A],block: controllers.Application.UserRequest[A] => scala.concurrent.Future[<error>]): scala.concurrent.Future[<error>]} to ?{def apply: ?}
19-Oct-2017 08:58:39 [error]   def configRabbitmqPage = WithRole("", Role_Admin) { implicit request =>
19-Oct-2017 08:58:39 [error]                                    ^
19-Oct-2017 08:58:39 [error] /home/bamboo/bamboo-agent-home/xml-data/build-dir/BD-TC90-JOB1/app/controllers/Application.scala:1737:53: <error>{def invokeBlock[A](request: play.api.mvc.Request[A],block: controllers.Application.UserRequest[A] => scala.concurrent.Future[<error>]): scala.concurrent.Future[<error>]} does not take parameters
19-Oct-2017 08:58:39 [error]   def configRabbitmqPage = WithRole("", Role_Admin) { implicit request =>
19-Oct-2017 08:58:39 [error]                                                     ^
19-Oct-2017 08:58:39 [error] /home/bamboo/bamboo-agent-home/xml-data/build-dir/BD-TC90-JOB1/app/controllers/Application.scala:1743:48: type mismatch;
19-Oct-2017 08:58:39 [error]  found   : <error>{def invokeBlock[A](request: play.api.mvc.Request[A],block: controllers.Application.UserRequest[A] => scala.concurrent.Future[<error>]): scala.concurrent.Future[<error>]}
19-Oct-2017 08:58:39 [error]  required: ?{def apply: ?}
19-Oct-2017 08:58:39 [error] Note that implicit conversions are not applicable because they are ambiguous:
19-Oct-2017 08:58:39 [error]  both method booleanArrayOps in object Predef of type (xs: Array[Boolean])scala.collection.mutable.ArrayOps.ofBoolean
19-Oct-2017 08:58:39 [error]  and method byteArrayOps in object Predef of type (xs: Array[Byte])scala.collection.mutable.ArrayOps.ofByte
19-Oct-2017 08:58:39 [error]  are possible conversion functions from <error>{def invokeBlock[A](request: play.api.mvc.Request[A],block: controllers.Application.UserRequest[A] => scala.concurrent.Future[<error>]): scala.concurrent.Future[<error>]} to ?{def apply: ?}
19-Oct-2017 08:58:39 [error]   def approveToolVersion(id: String) = WithRole("", Role_Admin) {
19-Oct-2017 08:58:39 [error]                                                ^
19-Oct-2017 08:58:39 [error] /home/bamboo/bamboo-agent-home/xml-data/build-dir/BD-TC90-JOB1/app/controllers/Application.scala:1743:65: <error>{def invokeBlock[A](request: play.api.mvc.Request[A],block: controllers.Application.UserRequest[A] => scala.concurrent.Future[<error>]): scala.concurrent.Future[<error>]} does not take parameters
19-Oct-2017 08:58:39 [error]   def approveToolVersion(id: String) = WithRole("", Role_Admin) {
19-Oct-2017 08:58:39 [error]                                                                 ^
19-Oct-2017 08:58:39 [error] /home/bamboo/bamboo-agent-home/xml-data/build-dir/BD-TC90-JOB1/app/controllers/Application.scala:1747:47: type mismatch;
19-Oct-2017 08:58:39 [error]  found   : <error>{def invokeBlock[A](request: play.api.mvc.Request[A],block: controllers.Application.UserRequest[A] => scala.concurrent.Future[<error>]): scala.concurrent.Future[<error>]}
19-Oct-2017 08:58:39 [error]  required: ?{def apply: ?}
19-Oct-2017 08:58:39 [error] Note that implicit conversions are not applicable because they are ambiguous:
19-Oct-2017 08:58:39 [error]  both method booleanArrayOps in object Predef of type (xs: Array[Boolean])scala.collection.mutable.ArrayOps.ofBoolean
19-Oct-2017 08:58:39 [error]  and method byteArrayOps in object Predef of type (xs: Array[Byte])scala.collection.mutable.ArrayOps.ofByte
19-Oct-2017 08:58:39 [error]  are possible conversion functions from <error>{def invokeBlock[A](request: play.api.mvc.Request[A],block: controllers.Application.UserRequest[A] => scala.concurrent.Future[<error>]): scala.concurrent.Future[<error>]} to ?{def apply: ?}
19-Oct-2017 08:58:39 [error]   def rejectToolVersion(id: String) = WithRole("", Role_Admin) {
19-Oct-2017 08:58:39 [error]                                               ^
19-Oct-2017 08:58:39 [error] /home/bamboo/bamboo-agent-home/xml-data/build-dir/BD-TC90-JOB1/app/controllers/Application.scala:1747:64: <error>{def invokeBlock[A](request: play.api.mvc.Request[A],block: controllers.Application.UserRequest[A] => scala.concurrent.Future[<error>]): scala.concurrent.Future[<error>]} does not take parameters
19-Oct-2017 08:58:39 [error]   def rejectToolVersion(id: String) = WithRole("", Role_Admin) {
19-Oct-2017 08:58:39 [error]                                                                ^
19-Oct-2017 08:58:39 [error] /home/bamboo/bamboo-agent-home/xml-data/build-dir/BD-TC90-JOB1/app/controllers/Application.scala:1751:47: type mismatch;
19-Oct-2017 08:58:39 [error]  found   : <error>{def invokeBlock[A](request: play.api.mvc.Request[A],block: controllers.Application.UserRequest[A] => scala.concurrent.Future[<error>]): scala.concurrent.Future[<error>]}
19-Oct-2017 08:58:39 [error]  required: ?{def apply: ?}
19-Oct-2017 08:58:39 [error] Note that implicit conversions are not applicable because they are ambiguous:
19-Oct-2017 08:58:39 [error]  both method booleanArrayOps in object Predef of type (xs: Array[Boolean])scala.collection.mutable.ArrayOps.ofBoolean
19-Oct-2017 08:58:39 [error]  and method byteArrayOps in object Predef of type (xs: Array[Byte])scala.collection.mutable.ArrayOps.ofByte
19-Oct-2017 08:58:39 [error]  are possible conversion functions from <error>{def invokeBlock[A](request: play.api.mvc.Request[A],block: controllers.Application.UserRequest[A] => scala.concurrent.Future[<error>]): scala.concurrent.Future[<error>]} to ?{def apply: ?}
19-Oct-2017 08:58:39 [error]   def revokeToolVersion(id: String) = WithRole("", Role_Admin) {
19-Oct-2017 08:58:39 [error]                                               ^
19-Oct-2017 08:58:39 [error] /home/bamboo/bamboo-agent-home/xml-data/build-dir/BD-TC90-JOB1/app/controllers/Application.scala:1751:64: <error>{def invokeBlock[A](request: play.api.mvc.Request[A],block: controllers.Application.UserRequest[A] => scala.concurrent.Future[<error>]): scala.concurrent.Future[<error>]} does not take parameters
19-Oct-2017 08:58:39 [error]   def revokeToolVersion(id: String) = WithRole("", Role_Admin) {
19-Oct-2017 08:58:39 [error]                                                                ^
19-Oct-2017 08:58:39 [error] /home/bamboo/bamboo-agent-home/xml-data/build-dir/BD-TC90-JOB1/app/controllers/Application.scala:1755:50: type mismatch;
19-Oct-2017 08:58:39 [error]  found   : <error>{def invokeBlock[A](request: play.api.mvc.Request[A],block: controllers.Application.UserRequest[A] => scala.concurrent.Future[<error>]): scala.concurrent.Future[<error>]}
19-Oct-2017 08:58:39 [error]  required: ?{def apply: ?}
19-Oct-2017 08:58:39 [error] Note that implicit conversions are not applicable because they are ambiguous:
19-Oct-2017 08:58:39 [error]  both method booleanArrayOps in object Predef of type (xs: Array[Boolean])scala.collection.mutable.ArrayOps.ofBoolean
19-Oct-2017 08:58:39 [error]  and method byteArrayOps in object Predef of type (xs: Array[Byte])scala.collection.mutable.ArrayOps.ofByte
19-Oct-2017 08:58:39 [error]  are possible conversion functions from <error>{def invokeBlock[A](request: play.api.mvc.Request[A],block: controllers.Application.UserRequest[A] => scala.concurrent.Future[<error>]): scala.concurrent.Future[<error>]} to ?{def apply: ?}
19-Oct-2017 08:58:39 [error]   def reapproveToolVersion(id: String) = WithRole("", Role_Admin) {
19-Oct-2017 08:58:39 [error]                                                  ^
19-Oct-2017 08:58:39 [error] /home/bamboo/bamboo-agent-home/xml-data/build-dir/BD-TC90-JOB1/app/controllers/Application.scala:1755:67: <error>{def invokeBlock[A](request: play.api.mvc.Request[A],block: controllers.Application.UserRequest[A] => scala.concurrent.Future[<error>]): scala.concurrent.Future[<error>]} does not take parameters
19-Oct-2017 08:58:39 [error]   def reapproveToolVersion(id: String) = WithRole("", Role_Admin) {
19-Oct-2017 08:58:39 [error]                                                                   ^
19-Oct-2017 08:58:39 [error] /home/bamboo/bamboo-agent-home/xml-data/build-dir/BD-TC90-JOB1/app/controllers/Application.scala:1968:7: not found: value Routes
19-Oct-2017 08:58:39 [error]       Routes.javascriptRouter("jsRoutes")(
19-Oct-2017 08:58:39 [error]       ^
19-Oct-2017 08:58:39 [error] /home/bamboo/bamboo-agent-home/xml-data/build-dir/BD-TC90-JOB1/app/controllers/Application.scala:2011:40: type mismatch;
19-Oct-2017 08:58:39 [error]  found   : <error>{def invokeBlock[A](request: play.api.mvc.Request[A],block: controllers.Application.UserRequest[A] => scala.concurrent.Future[<error>]): scala.concurrent.Future[<error>]}
19-Oct-2017 08:58:39 [error]  required: ?{def apply: ?}
19-Oct-2017 08:58:39 [error] Note that implicit conversions are not applicable because they are ambiguous:
19-Oct-2017 08:58:39 [error]  both method booleanArrayOps in object Predef of type (xs: Array[Boolean])scala.collection.mutable.ArrayOps.ofBoolean
19-Oct-2017 08:58:39 [error]  and method byteArrayOps in object Predef of type (xs: Array[Byte])scala.collection.mutable.ArrayOps.ofByte
19-Oct-2017 08:58:39 [error]  are possible conversion functions from <error>{def invokeBlock[A](request: play.api.mvc.Request[A],block: controllers.Application.UserRequest[A] => scala.concurrent.Future[<error>]): scala.concurrent.Future[<error>]} to ?{def apply: ?}
19-Oct-2017 08:58:39 [error]   def showToolsMonitorPage() = WithRole("", Role_Admin) { implicit request =>
19-Oct-2017 08:58:39 [error]                                        ^
19-Oct-2017 08:58:39 [error] /home/bamboo/bamboo-agent-home/xml-data/build-dir/BD-TC90-JOB1/app/controllers/Application.scala:2011:57: <error>{def invokeBlock[A](request: play.api.mvc.Request[A],block: controllers.Application.UserRequest[A] => scala.concurrent.Future[<error>]): scala.concurrent.Future[<error>]} does not take parameters
19-Oct-2017 08:58:39 [error]   def showToolsMonitorPage() = WithRole("", Role_Admin) { implicit request =>
19-Oct-2017 08:58:39 [error]                                                         ^
19-Oct-2017 08:58:39 [error] /home/bamboo/bamboo-agent-home/xml-data/build-dir/BD-TC90-JOB1/app/controllers/Application.scala:2214:29: type mismatch;
19-Oct-2017 08:58:39 [error]  found   : <error>{def invokeBlock[A](request: play.api.mvc.Request[A],block: controllers.Application.UserRequest[A] => scala.concurrent.Future[<error>]): scala.concurrent.Future[<error>]}
19-Oct-2017 08:58:39 [error]  required: ?{def apply: ?}
19-Oct-2017 08:58:39 [error] Note that implicit conversions are not applicable because they are ambiguous:
19-Oct-2017 08:58:39 [error]  both method booleanArrayOps in object Predef of type (xs: Array[Boolean])scala.collection.mutable.ArrayOps.ofBoolean
19-Oct-2017 08:58:39 [error]  and method byteArrayOps in object Predef of type (xs: Array[Byte])scala.collection.mutable.ArrayOps.ofByte
19-Oct-2017 08:58:39 [error]  are possible conversion functions from <error>{def invokeBlock[A](request: play.api.mvc.Request[A],block: controllers.Application.UserRequest[A] => scala.concurrent.Future[<error>]): scala.concurrent.Future[<error>]} to ?{def apply: ?}
19-Oct-2017 08:58:39 [error]   def getAllVMs() = WithRole("", Role_Admin) { implicit request =>
19-Oct-2017 08:58:39 [error]                             ^
19-Oct-2017 08:58:39 [error] /home/bamboo/bamboo-agent-home/xml-data/build-dir/BD-TC90-JOB1/app/controllers/Application.scala:2214:46: <error>{def invokeBlock[A](request: play.api.mvc.Request[A],block: controllers.Application.UserRequest[A] => scala.concurrent.Future[<error>]): scala.concurrent.Future[<error>]} does not take parameters
19-Oct-2017 08:58:39 [error]   def getAllVMs() = WithRole("", Role_Admin) { implicit request =>
19-Oct-2017 08:58:39 [error]                                              ^
19-Oct-2017 08:58:39 [error] /home/bamboo/bamboo-agent-home/xml-data/build-dir/BD-TC90-JOB1/app/controllers/Application.scala:2225:45: not found: type BSONCollection
19-Oct-2017 08:58:39 [error]   private def returnCollections(collection: BSONCollection, limit: Int): Future[List[BSONDocument]] = {
19-Oct-2017 08:58:39 [error]                                             ^
19-Oct-2017 08:58:39 [error] /home/bamboo/bamboo-agent-home/xml-data/build-dir/BD-TC90-JOB1/app/controllers/Auth.scala:5:12: object ning is not a member of package com
19-Oct-2017 08:58:39 [error] import com.ning.http.client.Realm.AuthScheme
19-Oct-2017 08:58:39 [error]            ^
19-Oct-2017 08:58:39 [error] /home/bamboo/bamboo-agent-home/xml-data/build-dir/BD-TC90-JOB1/app/controllers/Auth.scala:12:8: object Routes is not a member of package play.api
19-Oct-2017 08:58:39 [error] import play.api.{Logger, Mode, Routes}
19-Oct-2017 08:58:39 [error]        ^
19-Oct-2017 08:58:39 [error] /home/bamboo/bamboo-agent-home/xml-data/build-dir/BD-TC90-JOB1/app/controllers/Auth.scala:49:34: not found: type Response
19-Oct-2017 08:58:39 [error]       val futureResponse: Future[Response] = WS.url(endpoint).withHeaders("Content-Type" -> "application/xml")
19-Oct-2017 08:58:39 [error]                                  ^
19-Oct-2017 08:58:39 [error] /home/bamboo/bamboo-agent-home/xml-data/build-dir/BD-TC90-JOB1/app/controllers/Auth.scala:49:46: not found: value WS
19-Oct-2017 08:58:39 [error]       val futureResponse: Future[Response] = WS.url(endpoint).withHeaders("Content-Type" -> "application/xml")
19-Oct-2017 08:58:39 [error]                                              ^
19-Oct-2017 08:58:39 [error] /home/bamboo/bamboo-agent-home/xml-data/build-dir/BD-TC90-JOB1/app/controllers/Auth.scala:51:49: not found: value AuthScheme
19-Oct-2017 08:58:39 [error]         .withAuth(crowdUsername, crowdPassword, AuthScheme.BASIC)
19-Oct-2017 08:58:39 [error]                                                 ^
19-Oct-2017 08:58:39 [error] /home/bamboo/bamboo-agent-home/xml-data/build-dir/BD-TC90-JOB1/app/controllers/Auth.scala:54:20: value status is not a member of Nothing
19-Oct-2017 08:58:39 [error]       if (response.status >= 200 && response.status < 300 || response.status == 304) {
19-Oct-2017 08:58:39 [error]                    ^
19-Oct-2017 08:58:39 [error] /home/bamboo/bamboo-agent-home/xml-data/build-dir/BD-TC90-JOB1/app/controllers/Auth.scala:54:46: value status is not a member of Nothing
19-Oct-2017 08:58:39 [error]       if (response.status >= 200 && response.status < 300 || response.status == 304) {
19-Oct-2017 08:58:39 [error]                                              ^
19-Oct-2017 08:58:39 [error] /home/bamboo/bamboo-agent-home/xml-data/build-dir/BD-TC90-JOB1/app/controllers/Auth.scala:54:71: value status is not a member of Nothing
19-Oct-2017 08:58:39 [error]       if (response.status >= 200 && response.status < 300 || response.status == 304) {
19-Oct-2017 08:58:39 [error]                                                                       ^
19-Oct-2017 08:58:39 [error] /home/bamboo/bamboo-agent-home/xml-data/build-dir/BD-TC90-JOB1/app/controllers/Auth.scala:55:19: value json is not a member of Nothing
19-Oct-2017 08:58:39 [error]         (response.json \ "email").asOpt[String]
19-Oct-2017 08:58:39 [error]                   ^
19-Oct-2017 08:58:39 [error] /home/bamboo/bamboo-agent-home/xml-data/build-dir/BD-TC90-JOB1/app/controllers/Auth.scala:58:58: value getAHCResponse is not a member of Nothing
19-Oct-2017 08:58:39 [error]         Logger.error("Error Getting Status: " + response.getAHCResponse.getResponseBody)
19-Oct-2017 08:58:39 [error]                                                          ^
19-Oct-2017 08:58:39 [error] /home/bamboo/bamboo-agent-home/xml-data/build-dir/BD-TC90-JOB1/app/controllers/Auth.scala:221:7: not found: value Routes
19-Oct-2017 08:58:39 [error]       Routes.javascriptRouter("jsRoutes")(
19-Oct-2017 08:58:39 [error]       ^
19-Oct-2017 08:58:39 [error] /home/bamboo/bamboo-agent-home/xml-data/build-dir/BD-TC90-JOB1/app/controllers/MessageController.scala:5:8: object Routes is not a member of package play.api
19-Oct-2017 08:58:39 [error] import play.api.Routes
19-Oct-2017 08:58:39 [error]        ^
19-Oct-2017 08:58:39 [error] /home/bamboo/bamboo-agent-home/xml-data/build-dir/BD-TC90-JOB1/app/controllers/MessageController.scala:18:8: not found: value Routes
19-Oct-2017 08:58:39 [error]     Ok(Routes.javascriptRouter("jsRoutes")(routes.javascript.MessageController.getMessage)).as(JAVASCRIPT)
19-Oct-2017 08:58:39 [error]        ^
19-Oct-2017 08:58:39 [error] /home/bamboo/bamboo-agent-home/xml-data/build-dir/BD-TC90-JOB1/app/dao/ClusterConfigDAO.scala:5:38: object default is not a member of package reactivemongo.api.collections
19-Oct-2017 08:58:39 [error] import reactivemongo.api.collections.default.BSONCollection
19-Oct-2017 08:58:39 [error]                                      ^
19-Oct-2017 08:58:39 [error] /home/bamboo/bamboo-agent-home/xml-data/build-dir/BD-TC90-JOB1/app/dao/ClusterConfigDAO.scala:16:27: not found: type BSONCollection
19-Oct-2017 08:58:39 [error]       val collection = db[BSONCollection]("cluster.configuration")
19-Oct-2017 08:58:39 [error]                           ^
19-Oct-2017 08:58:39 [error] /home/bamboo/bamboo-agent-home/xml-data/build-dir/BD-TC90-JOB1/app/dao/ClusterConfigDAO.scala:28:27: not found: type BSONCollection
19-Oct-2017 08:58:39 [error]       val collection = db[BSONCollection]("cluster.configuration")
19-Oct-2017 08:58:39 [error]                           ^
19-Oct-2017 08:58:39 [error] /home/bamboo/bamboo-agent-home/xml-data/build-dir/BD-TC90-JOB1/app/models/Tool.scala:123:18: constructor BSONObjectID in class BSONObjectID cannot be accessed in object ToolBSONWriter
19-Oct-2017 08:58:39 [error]         "_id" -> new BSONObjectID(t.id.getOrElse(BSONObjectID.generate.stringify)),
19-Oct-2017 08:58:39 [error]                  ^
19-Oct-2017 08:58:40 [error] /home/bamboo/bamboo-agent-home/xml-data/build-dir/BD-TC90-JOB1/app/models/ToolVersion.scala:136:18: constructor BSONObjectID in class BSONObjectID cannot be accessed in object ToolVersionBSONWriter
19-Oct-2017 08:58:40 [error]         "_id" -> new BSONObjectID(t.id.getOrElse(BSONObjectID.generate.stringify)),
19-Oct-2017 08:58:40 [error]                  ^
19-Oct-2017 08:58:40 [error] /home/bamboo/bamboo-agent-home/xml-data/build-dir/BD-TC90-JOB1/app/models/ToolVersion.scala:189:18: constructor BSONObjectID in class BSONObjectID cannot be accessed in object ToolVersion
19-Oct-2017 08:58:40 [error]           id.map(new BSONObjectID(_).stringify),
19-Oct-2017 08:58:40 [error]                  ^
19-Oct-2017 08:58:58 [error] 256 errors found
19-Oct-2017 08:58:58 [error] (compile:compileIncremental) Compilation failed
19-Oct-2017 08:58:58 [error] Total time: 32 s, completed Oct 19, 2017 8:58:58 AM
19-Oct-2017 08:58:58 [INFO] [10/19/2017 08:58:58.237] [Thread-2] [CoordinatedShutdown(akka://sbt-web)] Starting coordinated shutdown from JVM shutdown hook
19-Oct-2017 08:58:58 Failing task since return code of [/home/bamboo/sbt-0.13.2/bin/sbt compile] was 1 while expected 0
19-Oct-2017 08:58:58 Finished task 'compile' with result: Failed
19-Oct-2017 08:58:58 Running post build plugin 'Docker Container Cleanup'
19-Oct-2017 08:58:58 Running post build plugin 'NCover Results Collector'
19-Oct-2017 08:58:58 Running post build plugin 'Clover Results Collector'
19-Oct-2017 08:58:58 Running post build plugin 'npm Cache Cleanup'
19-Oct-2017 08:58:58 Running post build plugin 'Artifact Copier'
19-Oct-2017 08:58:58 Publishing an artifact: tools-catalog
19-Oct-2017 08:58:58 Unable to publish artifact [tools-catalog]: the source directory /home/bamboo/bamboo-agent-home/xml-data/build-dir/BD-TC90-JOB1/target/universal does not exist.
19-Oct-2017 08:58:58 The artifact hasn't been successfully published after 1.041 ms
19-Oct-2017 08:58:58 Finalising the build...
19-Oct-2017 08:58:58 Stopping timer.
19-Oct-2017 08:58:58 Build BD-TC90-JOB1-2 completed.
19-Oct-2017 08:58:58 Running on server: post build plugin 'NCover Results Collector'
19-Oct-2017 08:58:58 Running on server: post build plugin 'Build Hanging Detection Configuration'
19-Oct-2017 08:58:58 Running on server: post build plugin 'Clover Delta Calculator'
19-Oct-2017 08:58:58 Running on server: post build plugin 'Maven Dependencies Postprocessor'
19-Oct-2017 08:58:58 All post build plugins have finished
19-Oct-2017 08:58:58 Generating build results summary...
19-Oct-2017 08:58:58 Saving build results to disk...
19-Oct-2017 08:58:58 Logging substituted variables...
19-Oct-2017 08:58:58 Indexing build results...
19-Oct-2017 08:58:58 Finished building BD-TC90-JOB1-2.