Core application including web front end

Build: #1 failed

Job: default failed

Stages & jobs

  1. Default Stage

Job result summary

Completed
Duration
8 minutes
Revision
1b034094d6b11aafcf133fccf033b4d512424af6 1b034094d6b11aafcf133fccf033b4d512424af6
Total tests
83

Tests

  • 83 tests in total
  • 4 tests failed
  • 4 failures are new
  • 6 seconds taken in total.
New test failures 4
Status Test Duration
Collapse Failed CollectionsAPIAppSpec The Collections API Spec must respond to the listCollections() function routed by GET /api/collections/list History
< 1 sec
class org.scalatest.exceptions.TestFailedException: 401 did not equal 200

      org.scalatest.exceptions.TestFailedException: 401 did not equal 200
      at org.scalatest.MatchersHelper$.newTestFailedException(MatchersHelper.scala:160)
      at org.scalatest.MustMatchers$AnyMustWrapper.mustEqual(MustMatchers.scala:6213)
      at integration.CollectionsAPIAppSpec$$anonfun$2$$anonfun$apply$mcV$sp$17.apply$mcV$sp(CollectionsAPIAppSpec.scala:319)
      at integration.CollectionsAPIAppSpec$$anonfun$2$$anonfun$apply$mcV$sp$17.apply(CollectionsAPIAppSpec.scala:316)
      at integration.CollectionsAPIAppSpec$$anonfun$2$$anonfun$apply$mcV$sp$17.apply(CollectionsAPIAppSpec.scala:316)
(46 more lines...)
Collapse Failed DatasetsAPIAppSpec The Datasets API Spec must respond to the getTechnicalMetadataJSON(id: UUID) function routed by GET /api/datasets/:id/technicalmetadatajson History
< 1 sec
class org.scalatest.exceptions.TestFailedException: 401 did not equal 200

      org.scalatest.exceptions.TestFailedException: 401 did not equal 200
      at org.scalatest.MatchersHelper$.newTestFailedException(MatchersHelper.scala:160)
      at org.scalatest.MustMatchers$AnyMustWrapper.mustEqual(MustMatchers.scala:6213)
      at integration.DatasetsAPIAppSpec$$anonfun$2$$anonfun$apply$mcV$sp$18.apply$mcV$sp(DatasetsAPIAppSpec.scala:467)
      at integration.DatasetsAPIAppSpec$$anonfun$2$$anonfun$apply$mcV$sp$18.apply(DatasetsAPIAppSpec.scala:464)
      at integration.DatasetsAPIAppSpec$$anonfun$2$$anonfun$apply$mcV$sp$18.apply(DatasetsAPIAppSpec.scala:464)
(46 more lines...)
Collapse Failed DatasetsAPIAppSpec The Datasets API Spec must respond to the getUserMetadataJSON(id: UUID) function routed by GET /api/datasets/:id/usermetadata History
< 1 sec
class org.scalatest.exceptions.TestFailedException: 401 did not equal 200

      org.scalatest.exceptions.TestFailedException: 401 did not equal 200
      at org.scalatest.MatchersHelper$.newTestFailedException(MatchersHelper.scala:160)
      at org.scalatest.MustMatchers$AnyMustWrapper.mustEqual(MustMatchers.scala:6213)
      at integration.DatasetsAPIAppSpec$$anonfun$2$$anonfun$apply$mcV$sp$17.apply$mcV$sp(DatasetsAPIAppSpec.scala:455)
      at integration.DatasetsAPIAppSpec$$anonfun$2$$anonfun$apply$mcV$sp$17.apply(DatasetsAPIAppSpec.scala:452)
      at integration.DatasetsAPIAppSpec$$anonfun$2$$anonfun$apply$mcV$sp$17.apply(DatasetsAPIAppSpec.scala:452)
(46 more lines...)
Collapse Failed FilesAPIAppSpec The Files API Spec must respond to the get(id: UUID) function routed by GET /api/files/:id/metadata History
< 1 sec
class org.scalatest.exceptions.TestFailedException: 401 did not equal 200

      org.scalatest.exceptions.TestFailedException: 401 did not equal 200
      at org.scalatest.MatchersHelper$.newTestFailedException(MatchersHelper.scala:160)
      at org.scalatest.MustMatchers$AnyMustWrapper.mustEqual(MustMatchers.scala:6213)
      at integration.FilesAPIAppSpec$$anonfun$2$$anonfun$apply$mcV$sp$8.apply$mcV$sp(FilesAPIAppSpec.scala:179)
      at integration.FilesAPIAppSpec$$anonfun$2$$anonfun$apply$mcV$sp$8.apply(FilesAPIAppSpec.scala:175)
      at integration.FilesAPIAppSpec$$anonfun$2$$anonfun$apply$mcV$sp$8.apply(FilesAPIAppSpec.scala:175)
(46 more lines...)

Error summary

The build generated some errors. See the full build log for more details.

Java HotSpot(TM) 64-Bit Server VM warning: ignoring option MaxPermSize=384M; support was removed in 8.0
Java HotSpot(TM) 64-Bit Server VM warning: ignoring option MaxPermSize=384M; support was removed in 8.0
Java HotSpot(TM) 64-Bit Server VM warning: ignoring option MaxPermSize=384M; support was removed in 8.0
Java HotSpot(TM) 64-Bit Server VM warning: ignoring option MaxPermSize=384M; support was removed in 8.0
Java HotSpot(TM) 64-Bit Server VM warning: ignoring option MaxPermSize=384M; support was removed in 8.0
/home/bamboo/bamboo-agent-home/xml-data/build-dir/CATS-CORE474-JOB1/doc/src/sphinx/license.rst:10: WARNING: Title underline too short.

Contributors
-------
/home/bamboo/bamboo-agent-home/xml-data/build-dir/CATS-CORE474-JOB1/doc/src/sphinx/index.rst:36: WARNING: toctree contains reference to document u'source' that doesn't have a title: no link will be generated
/home/bamboo/bamboo-agent-home/xml-data/build-dir/CATS-CORE474-JOB1/doc/src/sphinx/index.rst:36: WARNING: toctree contains reference to document u'setup' that doesn't have a title: no link will be generated
/home/bamboo/bamboo-agent-home/xml-data/build-dir/CATS-CORE474-JOB1/doc/src/sphinx/index.rst:36: WARNING: toctree contains reference to document u'source' that doesn't have a title: no link will be generated
/home/bamboo/bamboo-agent-home/xml-data/build-dir/CATS-CORE474-JOB1/doc/src/sphinx/index.rst:36: WARNING: toctree contains reference to document u'setup' that doesn't have a title: no link will be generated
/home/bamboo/bamboo-agent-home/xml-data/build-dir/CATS-CORE474-JOB1/doc/src/sphinx/index.rst:36: WARNING: toctree contains reference to document u'source' that doesn't have a title: no link will be generated
/home/bamboo/bamboo-agent-home/xml-data/build-dir/CATS-CORE474-JOB1/doc/src/sphinx/index.rst:36: WARNING: toctree contains reference to document u'setup' that doesn't have a title: no link will be generated
/home/bamboo/bamboo-agent-home/xml-data/build-dir/CATS-CORE474-JOB1/doc/src/sphinx/index.rst:36: WARNING: toctree contains reference to document u'source' that doesn't have a title: no link will be generated
/home/bamboo/bamboo-agent-home/xml-data/build-dir/CATS-CORE474-JOB1/doc/src/sphinx/index.rst:36: WARNING: toctree contains reference to document u'setup' that doesn't have a title: no link will be generated
/home/bamboo/bamboo-agent-home/xml-data/build-dir/CATS-CORE474-JOB1/doc/src/sphinx/index.rst:36: WARNING: toctree contains reference to document u'source' that doesn't have a title: no link will be generated
/home/bamboo/bamboo-agent-home/xml-data/build-dir/CATS-CORE474-JOB1/doc/src/sphinx/index.rst:36: WARNING: toctree contains reference to document u'setup' that doesn't have a title: no link will be generated
/home/bamboo/bamboo-agent-home/xml-data/build-dir/CATS-CORE474-JOB1/doc/src/sphinx/index.rst:36: WARNING: toctree contains reference to document u'source' that doesn't have a title: no link will be generated
/home/bamboo/bamboo-agent-home/xml-data/build-dir/CATS-CORE474-JOB1/doc/src/sphinx/index.rst:36: WARNING: toctree contains reference to document u'setup' that doesn't have a title: no link will be generated
/home/bamboo/bamboo-agent-home/xml-data/build-dir/CATS-CORE474-JOB1/doc/src/sphinx/index.rst:36: WARNING: toctree contains reference to document u'source' that doesn't have a title: no link will be generated
/home/bamboo/bamboo-agent-home/xml-data/build-dir/CATS-CORE474-JOB1/doc/src/sphinx/index.rst:36: WARNING: toctree contains reference to document u'setup' that doesn't have a title: no link will be generated
/home/bamboo/bamboo-agent-home/xml-data/build-dir/CATS-CORE474-JOB1/doc/src/sphinx/index.rst:36: WARNING: toctree contains reference to document u'source' that doesn't have a title: no link will be generated
/home/bamboo/bamboo-agent-home/xml-data/build-dir/CATS-CORE474-JOB1/doc/src/sphinx/index.rst:36: WARNING: toctree contains reference to document u'setup' that doesn't have a title: no link will be generated
/home/bamboo/bamboo-agent-home/xml-data/build-dir/CATS-CORE474-JOB1/doc/src/sphinx/index.rst:36: WARNING: toctree contains reference to document u'source' that doesn't have a title: no link will be generated
/home/bamboo/bamboo-agent-home/xml-data/build-dir/CATS-CORE474-JOB1/doc/src/sphinx/index.rst:36: WARNING: toctree contains reference to document u'setup' that doesn't have a title: no link will be generated
/home/bamboo/bamboo-agent-home/xml-data/build-dir/CATS-CORE474-JOB1/doc/src/sphinx/index.rst:36: WARNING: toctree contains reference to document u'source' that doesn't have a title: no link will be generated
/home/bamboo/bamboo-agent-home/xml-data/build-dir/CATS-CORE474-JOB1/doc/src/sphinx/index.rst:36: WARNING: toctree contains reference to document u'setup' that doesn't have a title: no link will be generated
/home/bamboo/bamboo-agent-home/xml-data/build-dir/CATS-CORE474-JOB1/doc/src/sphinx/index.rst:36: WARNING: toctree contains reference to document u'source' that doesn't have a title: no link will be generated
/home/bamboo/bamboo-agent-home/xml-data/build-dir/CATS-CORE474-JOB1/doc/src/sphinx/index.rst:36: WARNING: toctree contains reference to document u'setup' that doesn't have a title: no link will be generated
/home/bamboo/bamboo-agent-home/xml-data/build-dir/CATS-CORE474-JOB1/doc/src/sphinx/index.rst:36: WARNING: toctree contains reference to document u'source' that doesn't have a title: no link will be generated
/home/bamboo/bamboo-agent-home/xml-data/build-dir/CATS-CORE474-JOB1/doc/src/sphinx/index.rst:36: WARNING: toctree contains reference to document u'setup' that doesn't have a title: no link will be generated
/home/bamboo/bamboo-agent-home/xml-data/build-dir/CATS-CORE474-JOB1/doc/src/sphinx/index.rst:36: WARNING: toctree contains reference to document u'source' that doesn't have a title: no link will be generated
/home/bamboo/bamboo-agent-home/xml-data/build-dir/CATS-CORE474-JOB1/doc/src/sphinx/index.rst:36: WARNING: toctree contains reference to document u'setup' that doesn't have a title: no link will be generated
/home/bamboo/bamboo-agent-home/xml-data/build-dir/CATS-CORE474-JOB1/doc/src/sphinx/index.rst:36: WARNING: toctree contains reference to document u'source' that doesn't have a title: no link will be generated
/home/bamboo/bamboo-agent-home/xml-data/build-dir/CATS-CORE474-JOB1/doc/src/sphinx/index.rst:36: WARNING: toctree contains reference to document u'setup' that doesn't have a title: no link will be generated
/home/bamboo/bamboo-agent-home/xml-data/build-dir/CATS-CORE474-JOB1/doc/src/sphinx/index.rst:36: WARNING: toctree contains reference to document u'source' that doesn't have a title: no link will be generated
/home/bamboo/bamboo-agent-home/xml-data/build-dir/CATS-CORE474-JOB1/doc/src/sphinx/index.rst:36: WARNING: toctree contains reference to document u'setup' that doesn't have a title: no link will be generated