Core application including web front end

Build: #1 failed

Job: default failed

Stages & jobs

  1. Default Stage

Build log

The build generated 2,534 lines of output.The output is too long and has been truncated to the last 1,000 lines. Download or view full build log.

25-Jul-2016 15:56:12 [info]       "kurtosis" : "-1.13473",
25-Jul-2016 15:56:12 [info]       "skewness" : "0.595271"
25-Jul-2016 15:56:12 [info]     },
25-Jul-2016 15:56:12 [info]     "Blue" : {
25-Jul-2016 15:56:12 [info]       "min" : "0(0)",
25-Jul-2016 15:56:12 [info]       "max" : "255(1)",
25-Jul-2016 15:56:12 [info]       "mean" : "79.6365(0.3123)",
25-Jul-2016 15:56:12 [info]       "standarddeviation" : "55.4165(0.21732)",
25-Jul-2016 15:56:12 [info]       "kurtosis" : "-0.872806",
25-Jul-2016 15:56:12 [info]       "skewness" : "0.669403"
25-Jul-2016 15:56:12 [info]     }
25-Jul-2016 15:56:12 [info]   },
25-Jul-2016 15:56:12 [info]   "Imagestatistics" : {
25-Jul-2016 15:56:12 [info]     "Overall" : {
25-Jul-2016 15:56:12 [info]       "min" : "0(0)",
25-Jul-2016 15:56:12 [info]       "max" : "255(1)",
25-Jul-2016 15:56:12 [info]       "mean" : "90.1616(0.353575)",
25-Jul-2016 15:56:12 [info]       "standarddeviation" : "64.5119(0.252988)",
25-Jul-2016 15:56:12 [info]       "kurtosis" : "-0.975723",
25-Jul-2016 15:56:12 [info]       "skewness" : "0.636514"
25-Jul-2016 15:56:12 [info]     }
25-Jul-2016 15:56:12 [info]   },
25-Jul-2016 15:56:12 [info]   "Renderingintent" : "Perceptual",
25-Jul-2016 15:56:12 [info]   "Gamma" : "0.454545",
25-Jul-2016 15:56:12 [info]   "Chromaticity" : {
25-Jul-2016 15:56:12 [info]     "redprimary" : "(0.64,0.33)",
25-Jul-2016 15:56:12 [info]     "greenprimary" : "(0.3,0.6)",
25-Jul-2016 15:56:12 [info]     "blueprimary" : "(0.15,0.06)",
25-Jul-2016 15:56:12 [info]     "whitepoint" : "(0.3127,0.329)"
25-Jul-2016 15:56:12 [info]   },
25-Jul-2016 15:56:12 [info]   "Backgroundcolor" : "white",
25-Jul-2016 15:56:12 [info]   "Bordercolor" : "srgb(223,223,223)",
25-Jul-2016 15:56:12 [info]   "Mattecolor" : "grey74",
25-Jul-2016 15:56:12 [info]   "Transparentcolor" : "black",
25-Jul-2016 15:56:12 [info]   "Interlace" : "None",
25-Jul-2016 15:56:12 [info]   "Intensity" : "Undefined",
25-Jul-2016 15:56:12 [info]   "Compose" : "Over",
25-Jul-2016 15:56:12 [info]   "Pagegeometry" : "640x299+0+0",
25-Jul-2016 15:56:12 [info]   "Dispose" : "Undefined",
25-Jul-2016 15:56:12 [info]   "Iterations" : "0",
25-Jul-2016 15:56:12 [info]   "Compression" : "JPEG",
25-Jul-2016 15:56:12 [info]   "Quality" : "93",
25-Jul-2016 15:56:12 [info]   "Orientation" : "TopLeft",
25-Jul-2016 15:56:12 [info]   "Properties" : {
25-Jul-2016 15:56:12 [info]     "date: create" : "2014-08-28T11: 07: 11-05: 00",
25-Jul-2016 15:56:12 [info]     "date: modify" : "2014-08-28T11: 07: 11-05: 00",
25-Jul-2016 15:56:12 [info]     "exif: ColorSpace" : "1",
25-Jul-2016 15:56:12 [info]     "exif: ComponentsConfiguration" : "1,2,3,0",
25-Jul-2016 15:56:12 [info]     "exif: Compression" : "6",
25-Jul-2016 15:56:12 [info]     "exif: ExifImageLength" : "299",
25-Jul-2016 15:56:12 [info]     "exif: ExifImageWidth" : "640",
25-Jul-2016 15:56:12 [info]     "exif: ExifOffset" : "102",
25-Jul-2016 15:56:12 [info]     "exif: ExifVersion" : "48,50,50,49",
25-Jul-2016 15:56:12 [info]     "exif: FlashPixVersion" : "48,49,48,48",
25-Jul-2016 15:56:12 [info]     "exif: JPEGInterchangeFormat" : "286",
25-Jul-2016 15:56:12 [info]     "exif: JPEGInterchangeFormatLength" : "7402",
25-Jul-2016 15:56:12 [info]     "exif: Orientation" : "1",
25-Jul-2016 15:56:12 [info]     "exif: ResolutionUnit" : "2",
25-Jul-2016 15:56:12 [info]     "exif: SceneCaptureType" : "0",
25-Jul-2016 15:56:12 [info]     "exif: thumbnail: ResolutionUnit" : "2",
25-Jul-2016 15:56:12 [info]     "exif: thumbnail: XResolution" : "72/1",
25-Jul-2016 15:56:12 [info]     "exif: thumbnail: YResolution" : "72/1",
25-Jul-2016 15:56:12 [info]     "exif: XResolution" : "72/1",
25-Jul-2016 15:56:12 [info]     "exif: YCbCrPositioning" : "1",
25-Jul-2016 15:56:12 [info]     "exif: YResolution" : "72/1",
25-Jul-2016 15:56:12 [info]     "jpeg: colorspace" : "2",
25-Jul-2016 15:56:12 [info]     "jpeg: sampling-factor" : "2x2,1x1,1x1",
25-Jul-2016 15:56:12 [info]     "signature" : "79e4979a6a880c120d7dc862a274ba452233fcf34459d05ca12f25af6dbfb0e6"
25-Jul-2016 15:56:12 [info]   },
25-Jul-2016 15:56:12 [info]   "Profiles" : {
25-Jul-2016 15:56:12 [info]     "Profile-exif" : "8188bytes"
25-Jul-2016 15:56:12 [info]   },
25-Jul-2016 15:56:12 [info]   "Artifacts" : {
25-Jul-2016 15:56:12 [info]     "filename" : "fname",
25-Jul-2016 15:56:12 [info]     "verbose" : "true"
25-Jul-2016 15:56:12 [info]   },
25-Jul-2016 15:56:12 [info]   "Tainted" : "False",
25-Jul-2016 15:56:12 [info]   "Filesize" : "58.1KB",
25-Jul-2016 15:56:12 [info]   "Numberpixels" : "191K",
25-Jul-2016 15:56:12 [info]   "Pixelspersecond" : "19.14MB",
25-Jul-2016 15:56:12 [info]   "Usertime" : "0.010u",
25-Jul-2016 15:56:12 [info]   "Elapsedtime" : "0: 01.009",
25-Jul-2016 15:56:12 [info]   "Version" : "ImageMagick6.8.6-32013-06-25Q16http: //www.imagemagick.org"
25-Jul-2016 15:56:12 [info] }
25-Jul-2016 15:56:12 2016-07-25 15:56:12,253 - [DEBUG  ] - application - File1 is File:True
25-Jul-2016 15:56:12 2016-07-25 15:56:12,283 - [DEBUG  ] - application - Getting value for tos.date
25-Jul-2016 15:56:12 2016-07-25 15:56:12,285 - [DEBUG  ] - application - Adding user metadata to file 57967ce660b2dad13fd4fb98
25-Jul-2016 15:56:12 2016-07-25 15:56:12,286 - [DEBUG  ] - application - Adding/modifying user metadata to file 57967ce660b2dad13fd4fb98 : {"Description":"Pretty picture of bronze sign","Items":"Sign, Bridge, Building","Other":"Sunny Day"}
25-Jul-2016 15:56:12 2016-07-25 15:56:12,383 - [DEBUG  ] - application - tagStr=[]
25-Jul-2016 15:56:12 2016-07-25 15:56:12,386 - [DEBUG  ] - application - commentStr=[]
25-Jul-2016 15:56:12 2016-07-25 15:56:12,388 - [DEBUG  ] - application - usrmd={ "Description" : "Pretty picture of bronze sign" , "Items" : "Sign, Bridge, Building" , "Other" : "Sunny Day"}
25-Jul-2016 15:56:12 2016-07-25 15:56:12,390 - [DEBUG  ] - application - techmd={}
25-Jul-2016 15:56:12 2016-07-25 15:56:12,394 - [DEBUG  ] - application - xmlmd={ }
25-Jul-2016 15:56:12 [play-akka.actor.default-dispatcher-8] INFO  elasticsearch.plugins  - [Dyna-Mite] loaded [], sites []
25-Jul-2016 15:56:17 [info] - must respond to the addUserMetadata(id: UUID) function routed by POST /api/files/:id/usermetadata *** FAILED ***
25-Jul-2016 15:56:17 [info]   java.util.concurrent.TimeoutException: Futures timed out after [5 seconds]
25-Jul-2016 15:56:17 [info]   at scala.concurrent.impl.Promise$DefaultPromise.ready(Promise.scala:219)
25-Jul-2016 15:56:17 [info]   at scala.concurrent.impl.Promise$DefaultPromise.result(Promise.scala:223)
25-Jul-2016 15:56:17 [info]   at scala.concurrent.Await$$anonfun$result$1.apply(package.scala:107)
25-Jul-2016 15:56:17 [info]   at scala.concurrent.BlockContext$DefaultBlockContext$.blockOn(BlockContext.scala:53)
25-Jul-2016 15:56:17 [info]   at scala.concurrent.Await$.result(package.scala:107)
25-Jul-2016 15:56:17 [info]   at play.api.test.ResultExtractors$class.status(Helpers.scala:324)
25-Jul-2016 15:56:17 [info]   at play.api.test.Helpers$.status(Helpers.scala:364)
25-Jul-2016 15:56:17 [info]   at integration.FilesAPIAppSpec$$anonfun$2$$anonfun$apply$mcV$sp$7.apply$mcV$sp(FilesAPIAppSpec.scala:168)
25-Jul-2016 15:56:17 [info]   at integration.FilesAPIAppSpec$$anonfun$2$$anonfun$apply$mcV$sp$7.apply(FilesAPIAppSpec.scala:148)
25-Jul-2016 15:56:17 [info]   at integration.FilesAPIAppSpec$$anonfun$2$$anonfun$apply$mcV$sp$7.apply(FilesAPIAppSpec.scala:148)
25-Jul-2016 15:56:17 [info]   ...
25-Jul-2016 15:56:17 [info]   + Working Directory: /home/bamboo/bamboo-agent-home/xml-data/build-dir/CATS-CORE606-JOB1
25-Jul-2016 15:56:17 [info]   + File Pathing /home/bamboo/bamboo-agent-home/xml-data/build-dir/CATS-CORE606-JOB1/test/data/files/data-test-user.json
25-Jul-2016 15:56:17 [info]   + Pretty JSON format
25-Jul-2016 15:56:17 [info]   + {
25-Jul-2016 15:56:17 [info]   "Description" : "Pretty picture of bronze sign",
25-Jul-2016 15:56:17 [info]   "Items" : "Sign, Bridge, Building",
25-Jul-2016 15:56:17 [info]   "Other" : "Sunny Day"
25-Jul-2016 15:56:17 [info] }
25-Jul-2016 15:56:17 2016-07-25 15:56:17,301 - [DEBUG  ] - application - Getting value for tos.date
25-Jul-2016 15:56:17 2016-07-25 15:56:17,303 - [INFO   ] - application - GET file with id 57967ce660b2dad13fd4fb98
25-Jul-2016 15:56:17 [info] - must respond to the get(id: UUID) function routed by GET /api/files/:id/metadata
25-Jul-2016 15:56:17 [info]   + Status_Get=200
25-Jul-2016 15:56:17 2016-07-25 15:56:17,318 - [DEBUG  ] - application - File1 is File:True
25-Jul-2016 15:56:17 [info]   + contentType_Get=Some(application/json)
25-Jul-2016 15:56:17 [info]   + Pretty JSON format
25-Jul-2016 15:56:17 [info]   + {
25-Jul-2016 15:56:17 [info]   "size" : "1267871",
25-Jul-2016 15:56:17 [info]   "date-created" : "Mon Jul 25 15:56:06 CDT 2016",
25-Jul-2016 15:56:17 [info]   "id" : "57967ce660b2dad13fd4fb98",
25-Jul-2016 15:56:17 [info]   "authorId" : "000000000000000000000000",
25-Jul-2016 15:56:17 [info]   "content-type" : "image/jpeg",
25-Jul-2016 15:56:17 [info]   "filename" : "morrowplots.jpg",
25-Jul-2016 15:56:17 [info]   "status" : "UPLOADED",
25-Jul-2016 15:56:17 [info]   "filedescription" : ""
25-Jul-2016 15:56:17 [info] }
25-Jul-2016 15:56:17 2016-07-25 15:56:17,337 - [DEBUG  ] - application - Getting value for tos.date
25-Jul-2016 15:56:17 2016-07-25 15:56:17,339 - [DEBUG  ] - application - Searching files' metadata for search tree.
25-Jul-2016 15:56:17 2016-07-25 15:56:17,340 - [DEBUG  ] - application - thejsson: {"Image":"fid"}
25-Jul-2016 15:56:17 2016-07-25 15:56:17,355 - [DEBUG  ] - application - top: {Image=fid}
25-Jul-2016 15:56:17 2016-07-25 15:56:17,357 - [DEBUG  ] - application - req: {Image=fid}
25-Jul-2016 15:56:17 2016-07-25 15:56:17,364 - [DEBUG  ] - application - thequery: { "$and" : [ { "$or" : [ { "userMetadata.Image" : "fid"} , { "metadata.Image" : "fid"} , { "xmlMetadata.Image" : "fid"}]}]}
25-Jul-2016 15:56:17 2016-07-25 15:56:17,366 - [DEBUG  ] - application - Search completed. Returning files list.
25-Jul-2016 15:56:17 2016-07-25 15:56:17,368 - [DEBUG  ] - application - thelist: []
25-Jul-2016 15:56:17 [info] - must respond to the searchFilesGeneralMetadata() function routed by POST /api/files/searchmetadata 
25-Jul-2016 15:56:17 [info]   + Working Directory: /home/bamboo/bamboo-agent-home/xml-data/build-dir/CATS-CORE606-JOB1
25-Jul-2016 15:56:17 [info]   + File Pathing /home/bamboo/bamboo-agent-home/xml-data/build-dir/CATS-CORE606-JOB1/test/data/files/data-search-general.json
25-Jul-2016 15:56:17 [info]   + Pretty JSON format
25-Jul-2016 15:56:17 [info]   + {
25-Jul-2016 15:56:17 [info]   "Image" : "fid"
25-Jul-2016 15:56:17 [info] }
25-Jul-2016 15:56:17 [info]   + Status=200
25-Jul-2016 15:56:17 [info]   + contentType=Some(application/json)
25-Jul-2016 15:56:17 [info]   + content[]
25-Jul-2016 15:56:17 2016-07-25 15:56:17,382 - [DEBUG  ] - application - File1 is File:True
25-Jul-2016 15:56:17 2016-07-25 15:56:17,393 - [DEBUG  ] - application - Getting value for tos.date
25-Jul-2016 15:56:17 2016-07-25 15:56:17,395 - [DEBUG  ] - application - Searching files' user metadata for search tree.
25-Jul-2016 15:56:17 2016-07-25 15:56:17,396 - [DEBUG  ] - application - thejsson: {"Description":".*bronze sign.*"}
25-Jul-2016 15:56:17 2016-07-25 15:56:17,396 - [DEBUG  ] - application - top: {Description=.*bronze sign.*}
25-Jul-2016 15:56:17 2016-07-25 15:56:17,396 - [DEBUG  ] - application - req: {Description=.*bronze sign.*}
25-Jul-2016 15:56:17 2016-07-25 15:56:17,398 - [DEBUG  ] - application - thequery: { "$and" : [ { "userMetadata.Description" : ".*bronze sign.*"}]}
25-Jul-2016 15:56:17 2016-07-25 15:56:17,400 - [DEBUG  ] - application - Search completed. Returning files list.
25-Jul-2016 15:56:17 2016-07-25 15:56:17,401 - [DEBUG  ] - application - thelist: []
25-Jul-2016 15:56:17 [info] - must respond to the searchFilesUserMetadata() function routed by POST /api/files/searchmetadata 
25-Jul-2016 15:56:17 [info]   + Working Directory: /home/bamboo/bamboo-agent-home/xml-data/build-dir/CATS-CORE606-JOB1
25-Jul-2016 15:56:17 [info]   + File Pathing /home/bamboo/bamboo-agent-home/xml-data/build-dir/CATS-CORE606-JOB1/test/data/files/data-search-user.json
25-Jul-2016 15:56:17 [info]   + Pretty JSON format
25-Jul-2016 15:56:17 [info]   + {
25-Jul-2016 15:56:17 [info]   "Description" : ".*bronze sign.*"
25-Jul-2016 15:56:17 [info] }
25-Jul-2016 15:56:17 [info]   + Status=200
25-Jul-2016 15:56:17 [info]   + contentType=Some(application/json)
25-Jul-2016 15:56:17 [info]   + content[]
25-Jul-2016 15:56:17 2016-07-25 15:56:17,436 - [DEBUG  ] - application - Getting value for tos.date
25-Jul-2016 15:56:17 [info] - must respond to the attachThumbnail(file_id:UUID, thumbnail:UUID) function routed by POST /api/files/:file_id/thumbnails/:thumbnails_id 
25-Jul-2016 15:56:17 [info]   + Status_Get=200
25-Jul-2016 15:56:17 [info]   + contentType_Get=Some(application/json)
25-Jul-2016 15:56:17 [info]   + Pretty JSON format
25-Jul-2016 15:56:17 [info]   + {
25-Jul-2016 15:56:17 [info]   "status" : "success"
25-Jul-2016 15:56:17 [info] }
25-Jul-2016 15:56:17 2016-07-25 15:56:17,460 - [DEBUG  ] - application - Getting value for tos.date
25-Jul-2016 15:56:17 [info] - must respond to the listThumbnails() function routed by POST /api/thumbnails
25-Jul-2016 15:56:17 [info]   + Status=200
25-Jul-2016 15:56:17 [info]   + contentType=Some(application/json)
25-Jul-2016 15:56:17 [info]   + content[{"size":"9757","date-created":"Mon Jul 25 15:56:07 CDT 2016","id":"57967ce760b2dad13fd4fba3","content-type":"image/jpeg","filename":"morrowplots-thumb-1.jpg"}]
25-Jul-2016 15:56:17 2016-07-25 15:56:17,483 - [DEBUG  ] - application - Getting value for tos.date
25-Jul-2016 15:56:17 2016-07-25 15:56:17,491 - [DEBUG  ] - application - Deleting file from indexesmorrowplots.jpg
25-Jul-2016 15:56:17 2016-07-25 15:56:17,491 - [DEBUG  ] - application - Deleting file: morrowplots.jpg
25-Jul-2016 15:56:17 2016-07-25 15:56:17,504 - [DEBUG  ] - application - Sending message ExtractorMessage(,,,clowder.metadata.removed,Map(resourceType -> file, resourceId -> 57967ce660b2dad13fd4fb98),,57967ce660b2dad13fd4fb98,,phuong-test)
25-Jul-2016 15:56:22 [info] - must respond to the removeFile(id:UUID) function routed by DELETE /api/files/:id   *** FAILED ***
25-Jul-2016 15:56:22 [info]   java.util.concurrent.TimeoutException: Futures timed out after [5 seconds]
25-Jul-2016 15:56:22 [info]   at scala.concurrent.impl.Promise$DefaultPromise.ready(Promise.scala:219)
25-Jul-2016 15:56:22 [info]   at scala.concurrent.impl.Promise$DefaultPromise.result(Promise.scala:223)
25-Jul-2016 15:56:22 [info]   at scala.concurrent.Await$$anonfun$result$1.apply(package.scala:107)
25-Jul-2016 15:56:22 [info]   at scala.concurrent.BlockContext$DefaultBlockContext$.blockOn(BlockContext.scala:53)
25-Jul-2016 15:56:22 [info]   at scala.concurrent.Await$.result(package.scala:107)
25-Jul-2016 15:56:22 [info]   at play.api.test.ResultExtractors$class.status(Helpers.scala:324)
25-Jul-2016 15:56:22 [info]   at play.api.test.Helpers$.status(Helpers.scala:364)
25-Jul-2016 15:56:22 [info]   at integration.FilesAPIAppSpec$$anonfun$2$$anonfun$apply$mcV$sp$13.apply$mcV$sp(FilesAPIAppSpec.scala:270)
25-Jul-2016 15:56:22 [info]   at integration.FilesAPIAppSpec$$anonfun$2$$anonfun$apply$mcV$sp$13.apply(FilesAPIAppSpec.scala:268)
25-Jul-2016 15:56:22 [info]   at integration.FilesAPIAppSpec$$anonfun$2$$anonfun$apply$mcV$sp$13.apply(FilesAPIAppSpec.scala:268)
25-Jul-2016 15:56:22 [info]   ...
25-Jul-2016 15:56:22 2016-07-25 15:56:22,499 - [DEBUG  ] - application - Getting value for tos.date
25-Jul-2016 15:56:22 2016-07-25 15:56:22,501 - [DEBUG  ] - application - Couldn't find thumbnail
25-Jul-2016 15:56:22 [info] - must respond to the removeThumbnail(id:UUID) function routed by DELETE /api/thumbnails/:id 
25-Jul-2016 15:56:22 [info]   + Status_Get=200
25-Jul-2016 15:56:22 [info] DatasetsAPIAppSpec:
25-Jul-2016 15:56:22 [info] The Datasets API Spec
25-Jul-2016 15:56:22 [info] - must provide a FakeApplication
25-Jul-2016 15:56:22 [info] - must make the FakeApplication available implicitly
25-Jul-2016 15:56:22 [info] - must start the FakeApplication
25-Jul-2016 15:56:22 [info] The Datasets API Spec
25-Jul-2016 15:56:22 2016-07-25 15:56:22,558 - [DEBUG  ] - application - File1 is File:True
25-Jul-2016 15:56:22 2016-07-25 15:56:22,949 - [DEBUG  ] - application - Getting value for tos.date
25-Jul-2016 15:56:22 2016-07-25 15:56:22,978 - [INFO   ] - application - created file 57967cf660b2dad13fd4fba9
25-Jul-2016 15:56:22 2016-07-25 15:56:22,980 - [DEBUG  ] - application - Uploading file dataset-image.zip
25-Jul-2016 15:56:23 2016-07-25 15:56:23,092 - [DEBUG  ] - application - Getting value for tos.date
25-Jul-2016 15:56:23 2016-07-25 15:56:23,093 - [DEBUG  ] - application - --- API Creating new dataset ----
25-Jul-2016 15:56:23 2016-07-25 15:56:23,302 - [INFO   ] - application - Uploading Completed
25-Jul-2016 15:56:23 2016-07-25 15:56:23,303 - [DEBUG  ] - application - Sending message ExtractorMessage(57967cf660b2dad13fd4fba9,57967cf660b2dad13fd4fba9,https://,clowder.file.multi.files-zipped,Map(filename -> dataset-image.zip),3797692,null,,phuong-test)
25-Jul-2016 15:56:23 2016-07-25 15:56:23,319 - [DEBUG  ] - application - tagStr=[]
25-Jul-2016 15:56:23 2016-07-25 15:56:23,322 - [DEBUG  ] - application - commentStr=[]
25-Jul-2016 15:56:23 2016-07-25 15:56:23,322 - [DEBUG  ] - application - usrmd={}
25-Jul-2016 15:56:23 2016-07-25 15:56:23,328 - [DEBUG  ] - application - techmd={}
25-Jul-2016 15:56:23 2016-07-25 15:56:23,329 - [DEBUG  ] - application - xmlmd={ }
25-Jul-2016 15:56:23 [play-akka.actor.default-dispatcher-2] INFO  elasticsearch.plugins  - [Hermod] loaded [], sites []
25-Jul-2016 15:56:28 [info] - must respond to the createDataset() function routed by POST /api/datasets *** FAILED ***
25-Jul-2016 15:56:28 [info]   java.util.concurrent.TimeoutException: Futures timed out after [5 seconds]
25-Jul-2016 15:56:28 [info]   at scala.concurrent.impl.Promise$DefaultPromise.ready(Promise.scala:219)
25-Jul-2016 15:56:28 [info]   at scala.concurrent.impl.Promise$DefaultPromise.result(Promise.scala:223)
25-Jul-2016 15:56:28 [info]   at scala.concurrent.Await$$anonfun$result$1.apply(package.scala:107)
25-Jul-2016 15:56:28 [info]   at scala.concurrent.BlockContext$DefaultBlockContext$.blockOn(BlockContext.scala:53)
25-Jul-2016 15:56:28 [info]   at scala.concurrent.Await$.result(package.scala:107)
25-Jul-2016 15:56:28 [info]   at play.api.test.ResultExtractors$class.status(Helpers.scala:324)
25-Jul-2016 15:56:28 [info]   at play.api.test.Helpers$.status(Helpers.scala:364)
25-Jul-2016 15:56:28 [info]   at integration.DatasetsAPIAppSpec$$anonfun$2$$anonfun$apply$mcV$sp$4.apply$mcV$sp(DatasetsAPIAppSpec.scala:99)
25-Jul-2016 15:56:28 [info]   at integration.DatasetsAPIAppSpec$$anonfun$2$$anonfun$apply$mcV$sp$4.apply(DatasetsAPIAppSpec.scala:78)
25-Jul-2016 15:56:28 [info]   at integration.DatasetsAPIAppSpec$$anonfun$2$$anonfun$apply$mcV$sp$4.apply(DatasetsAPIAppSpec.scala:78)
25-Jul-2016 15:56:28 [info]   ...
25-Jul-2016 15:56:28 [info]   + Working Directory: /home/bamboo/bamboo-agent-home/xml-data/build-dir/CATS-CORE606-JOB1
25-Jul-2016 15:56:28 2016-07-25 15:56:28,122 - [DEBUG  ] - application - Getting value for tos.date
25-Jul-2016 15:56:28 [info] - must respond to the list() function routed by GET /api/datasets
25-Jul-2016 15:56:28 [info]   + Status=200
25-Jul-2016 15:56:28 [info]   + contentType=Some(application/json)
25-Jul-2016 15:56:28 [info]   + content[{"id":"57967cf760b2dad13fd4fbb3","name":"Dataset API Test Creation","description":"Part of Dataset API Test Suite","created":"Mon Jul 25 15:56:23 CDT 2016","thumbnail":"None","authorId":"000000000000000000000000"}]
25-Jul-2016 15:56:28 [info] - must respond to the datasetFilesList(id:UUID) function routed by GET /api/datasets/:id   *** FAILED ***
25-Jul-2016 15:56:28 [info]   301 did not equal 200 (DatasetsAPIAppSpec.scala:128)
25-Jul-2016 15:56:28 [info]   + Status_Get=301
25-Jul-2016 15:56:28 [info] - must respond to the datasetFilesList(id:UUID) function routed by GET /api/datasets/:id/listFiles   *** FAILED ***
25-Jul-2016 15:56:28 [info]   scala.MatchError: None (of class scala.None$)
25-Jul-2016 15:56:28 [info]   at integration.DatasetsAPIAppSpec$$anonfun$2$$anonfun$apply$mcV$sp$7.apply$mcV$sp(DatasetsAPIAppSpec.scala:139)
25-Jul-2016 15:56:28 [info]   at integration.DatasetsAPIAppSpec$$anonfun$2$$anonfun$apply$mcV$sp$7.apply(DatasetsAPIAppSpec.scala:138)
25-Jul-2016 15:56:28 [info]   at integration.DatasetsAPIAppSpec$$anonfun$2$$anonfun$apply$mcV$sp$7.apply(DatasetsAPIAppSpec.scala:138)
25-Jul-2016 15:56:28 [info]   at org.scalatest.Transformer$$anonfun$apply$1.apply(Transformer.scala:22)
25-Jul-2016 15:56:28 [info]   at org.scalatest.Transformer$$anonfun$apply$1.apply(Transformer.scala:22)
25-Jul-2016 15:56:28 [info]   at org.scalatest.OutcomeOf$class.outcomeOf(OutcomeOf.scala:85)
25-Jul-2016 15:56:28 [info]   at org.scalatest.OutcomeOf$.outcomeOf(OutcomeOf.scala:104)
25-Jul-2016 15:56:28 [info]   at org.scalatest.Transformer.apply(Transformer.scala:22)
25-Jul-2016 15:56:28 [info]   at org.scalatest.Transformer.apply(Transformer.scala:20)
25-Jul-2016 15:56:28 [info]   at org.scalatest.WordSpecLike$$anon$1.apply(WordSpecLike.scala:945)
25-Jul-2016 15:56:28 [info]   ...
25-Jul-2016 15:56:28 [info] - must respond to the updateLicense(id: UUID) function routed by POST /api/datasets/:id/license *** FAILED ***
25-Jul-2016 15:56:28 [info]   java.util.NoSuchElementException: None.get
25-Jul-2016 15:56:28 [info]   at scala.None$.get(Option.scala:313)
25-Jul-2016 15:56:28 [info]   at scala.None$.get(Option.scala:311)
25-Jul-2016 15:56:28 [info]   at integration.DatasetsAPIAppSpec$$anonfun$2$$anonfun$apply$mcV$sp$8.apply$mcV$sp(DatasetsAPIAppSpec.scala:154)
25-Jul-2016 15:56:28 [info]   at integration.DatasetsAPIAppSpec$$anonfun$2$$anonfun$apply$mcV$sp$8.apply(DatasetsAPIAppSpec.scala:151)
25-Jul-2016 15:56:28 [info]   at integration.DatasetsAPIAppSpec$$anonfun$2$$anonfun$apply$mcV$sp$8.apply(DatasetsAPIAppSpec.scala:151)
25-Jul-2016 15:56:28 [info]   at org.scalatest.Transformer$$anonfun$apply$1.apply(Transformer.scala:22)
25-Jul-2016 15:56:28 [info]   at org.scalatest.Transformer$$anonfun$apply$1.apply(Transformer.scala:22)
25-Jul-2016 15:56:28 [info]   at org.scalatest.OutcomeOf$class.outcomeOf(OutcomeOf.scala:85)
25-Jul-2016 15:56:28 [info]   at org.scalatest.OutcomeOf$.outcomeOf(OutcomeOf.scala:104)
25-Jul-2016 15:56:28 [info]   at org.scalatest.Transformer.apply(Transformer.scala:22)
25-Jul-2016 15:56:28 [info]   ...
25-Jul-2016 15:56:28 [info] - must respond to the comment(id: UUID) function routed by POST /api/datasets/:id/comment *** FAILED ***
25-Jul-2016 15:56:28 [info]   java.util.NoSuchElementException: None.get
25-Jul-2016 15:56:28 [info]   at scala.None$.get(Option.scala:313)
25-Jul-2016 15:56:28 2016-07-25 15:56:28,279 - [DEBUG  ] - application - File1 is File:True
25-Jul-2016 15:56:28 [info]   at scala.None$.get(Option.scala:311)
25-Jul-2016 15:56:28 [info]   at integration.DatasetsAPIAppSpec$$anonfun$2$$anonfun$apply$mcV$sp$9.apply$mcV$sp(DatasetsAPIAppSpec.scala:167)
25-Jul-2016 15:56:28 [info]   at integration.DatasetsAPIAppSpec$$anonfun$2$$anonfun$apply$mcV$sp$9.apply(DatasetsAPIAppSpec.scala:164)
25-Jul-2016 15:56:28 [info]   at integration.DatasetsAPIAppSpec$$anonfun$2$$anonfun$apply$mcV$sp$9.apply(DatasetsAPIAppSpec.scala:164)
25-Jul-2016 15:56:28 [info]   at org.scalatest.Transformer$$anonfun$apply$1.apply(Transformer.scala:22)
25-Jul-2016 15:56:28 [info]   at org.scalatest.Transformer$$anonfun$apply$1.apply(Transformer.scala:22)
25-Jul-2016 15:56:28 [info]   at org.scalatest.OutcomeOf$class.outcomeOf(OutcomeOf.scala:85)
25-Jul-2016 15:56:28 [info]   at org.scalatest.OutcomeOf$.outcomeOf(OutcomeOf.scala:104)
25-Jul-2016 15:56:28 [info]   at org.scalatest.Transformer.apply(Transformer.scala:22)
25-Jul-2016 15:56:28 [info]   ...
25-Jul-2016 15:56:28 [info] - must respond to the addTags(id: UUID) function routed by POST /api/datasets/:id/tags *** FAILED ***
25-Jul-2016 15:56:28 [info]   scala.MatchError: None (of class scala.None$)
25-Jul-2016 15:56:28 [info]   at integration.DatasetsAPIAppSpec$$anonfun$2$$anonfun$apply$mcV$sp$10.apply$mcV$sp(DatasetsAPIAppSpec.scala:195)
25-Jul-2016 15:56:28 [info]   at integration.DatasetsAPIAppSpec$$anonfun$2$$anonfun$apply$mcV$sp$10.apply(DatasetsAPIAppSpec.scala:177)
25-Jul-2016 15:56:28 [info]   at integration.DatasetsAPIAppSpec$$anonfun$2$$anonfun$apply$mcV$sp$10.apply(DatasetsAPIAppSpec.scala:177)
25-Jul-2016 15:56:28 2016-07-25 15:56:28,301 - [DEBUG  ] - application - File1 is File:True
25-Jul-2016 15:56:28 [info]   at org.scalatest.Transformer$$anonfun$apply$1.apply(Transformer.scala:22)
25-Jul-2016 15:56:28 [info]   at org.scalatest.Transformer$$anonfun$apply$1.apply(Transformer.scala:22)
25-Jul-2016 15:56:28 [info]   at org.scalatest.OutcomeOf$class.outcomeOf(OutcomeOf.scala:85)
25-Jul-2016 15:56:28 [info]   at org.scalatest.OutcomeOf$.outcomeOf(OutcomeOf.scala:104)
25-Jul-2016 15:56:28 [info]   at org.scalatest.Transformer.apply(Transformer.scala:22)
25-Jul-2016 15:56:28 [info]   at org.scalatest.Transformer.apply(Transformer.scala:20)
25-Jul-2016 15:56:28 [info]   at org.scalatest.WordSpecLike$$anon$1.apply(WordSpecLike.scala:945)
25-Jul-2016 15:56:28 [info]   ...
25-Jul-2016 15:56:28 [info]   + Working Directory: /home/bamboo/bamboo-agent-home/xml-data/build-dir/CATS-CORE606-JOB1
25-Jul-2016 15:56:28 [info]   + File Pathing /home/bamboo/bamboo-agent-home/xml-data/build-dir/CATS-CORE606-JOB1/test/data/datasets/dataset-test-tags.json
25-Jul-2016 15:56:28 [info]   + Pretty JSON format
25-Jul-2016 15:56:28 [info]   + {
25-Jul-2016 15:56:28 [info]   "tags" : [ "Dataset", "Test Suite", "Medici" ],
25-Jul-2016 15:56:28 [info]   "extractor_id" : "ncsa.cv.face"
25-Jul-2016 15:56:28 [info] }
25-Jul-2016 15:56:28 [info] - must respond to the removeTags(id: UUID) function routed by POST /api/datasets/:id/tags/remove *** FAILED ***
25-Jul-2016 15:56:28 [info]   scala.MatchError: None (of class scala.None$)
25-Jul-2016 15:56:28 [info]   at integration.DatasetsAPIAppSpec$$anonfun$2$$anonfun$apply$mcV$sp$11.apply$mcV$sp(DatasetsAPIAppSpec.scala:225)
25-Jul-2016 15:56:28 [info]   at integration.DatasetsAPIAppSpec$$anonfun$2$$anonfun$apply$mcV$sp$11.apply(DatasetsAPIAppSpec.scala:207)
25-Jul-2016 15:56:28 [info]   at integration.DatasetsAPIAppSpec$$anonfun$2$$anonfun$apply$mcV$sp$11.apply(DatasetsAPIAppSpec.scala:207)
25-Jul-2016 15:56:28 [info]   at org.scalatest.Transformer$$anonfun$apply$1.apply(Transformer.scala:22)
25-Jul-2016 15:56:28 [info]   at org.scalatest.Transformer$$anonfun$apply$1.apply(Transformer.scala:22)
25-Jul-2016 15:56:28 [info]   at org.scalatest.OutcomeOf$class.outcomeOf(OutcomeOf.scala:85)
25-Jul-2016 15:56:28 [info]   at org.scalatest.OutcomeOf$.outcomeOf(OutcomeOf.scala:104)
25-Jul-2016 15:56:28 [info]   at org.scalatest.Transformer.apply(Transformer.scala:22)
25-Jul-2016 15:56:28 [info]   at org.scalatest.Transformer.apply(Transformer.scala:20)
25-Jul-2016 15:56:28 [info]   at org.scalatest.WordSpecLike$$anon$1.apply(WordSpecLike.scala:945)
25-Jul-2016 15:56:28 [info]   ...
25-Jul-2016 15:56:28 [info]   + Working Directory: /home/bamboo/bamboo-agent-home/xml-data/build-dir/CATS-CORE606-JOB1
25-Jul-2016 15:56:28 [info]   + File Pathing /home/bamboo/bamboo-agent-home/xml-data/build-dir/CATS-CORE606-JOB1/test/data/datasets/dataset-test-tags-remove.json
25-Jul-2016 15:56:28 [info]   + Pretty JSON format
25-Jul-2016 15:56:28 [info]   + {
25-Jul-2016 15:56:28 [info]   "tags" : [ "Medici", "Test Suite" ],
25-Jul-2016 15:56:28 [info]   "extractor_id" : "ncsa.cv.face"
25-Jul-2016 15:56:28 [info] }
25-Jul-2016 15:56:28 [info] - must respond to the getTags(id:UUID) function routed by GET /api/datasets/:id/tags   *** FAILED ***
25-Jul-2016 15:56:28 [info]   scala.MatchError: None (of class scala.None$)
25-Jul-2016 15:56:28 [info]   at integration.DatasetsAPIAppSpec$$anonfun$2$$anonfun$apply$mcV$sp$12.apply$mcV$sp(DatasetsAPIAppSpec.scala:236)
25-Jul-2016 15:56:28 [info]   at integration.DatasetsAPIAppSpec$$anonfun$2$$anonfun$apply$mcV$sp$12.apply(DatasetsAPIAppSpec.scala:235)
25-Jul-2016 15:56:28 [info]   at integration.DatasetsAPIAppSpec$$anonfun$2$$anonfun$apply$mcV$sp$12.apply(DatasetsAPIAppSpec.scala:235)
25-Jul-2016 15:56:28 [info]   at org.scalatest.Transformer$$anonfun$apply$1.apply(Transformer.scala:22)
25-Jul-2016 15:56:28 [info]   at org.scalatest.Transformer$$anonfun$apply$1.apply(Transformer.scala:22)
25-Jul-2016 15:56:28 [info]   at org.scalatest.OutcomeOf$class.outcomeOf(OutcomeOf.scala:85)
25-Jul-2016 15:56:28 [info]   at org.scalatest.OutcomeOf$.outcomeOf(OutcomeOf.scala:104)
25-Jul-2016 15:56:28 [info]   at org.scalatest.Transformer.apply(Transformer.scala:22)
25-Jul-2016 15:56:28 [info]   at org.scalatest.Transformer.apply(Transformer.scala:20)
25-Jul-2016 15:56:28 [info]   at org.scalatest.WordSpecLike$$anon$1.apply(WordSpecLike.scala:945)
25-Jul-2016 15:56:28 [info]   ...
25-Jul-2016 15:56:28 2016-07-25 15:56:28,323 - [DEBUG  ] - application - File1 is File:True
25-Jul-2016 15:56:28 [info] - must respond to the addTags(id: UUID) function routed by POST /api/datasets/:id/tags round two *** FAILED ***
25-Jul-2016 15:56:28 [info]   scala.MatchError: None (of class scala.None$)
25-Jul-2016 15:56:28 [info]   at integration.DatasetsAPIAppSpec$$anonfun$2$$anonfun$apply$mcV$sp$13.apply$mcV$sp(DatasetsAPIAppSpec.scala:266)
25-Jul-2016 15:56:28 [info]   at integration.DatasetsAPIAppSpec$$anonfun$2$$anonfun$apply$mcV$sp$13.apply(DatasetsAPIAppSpec.scala:248)
25-Jul-2016 15:56:28 [info]   at integration.DatasetsAPIAppSpec$$anonfun$2$$anonfun$apply$mcV$sp$13.apply(DatasetsAPIAppSpec.scala:248)
25-Jul-2016 15:56:28 [info]   at org.scalatest.Transformer$$anonfun$apply$1.apply(Transformer.scala:22)
25-Jul-2016 15:56:28 [info]   at org.scalatest.Transformer$$anonfun$apply$1.apply(Transformer.scala:22)
25-Jul-2016 15:56:28 [info]   at org.scalatest.OutcomeOf$class.outcomeOf(OutcomeOf.scala:85)
25-Jul-2016 15:56:28 [info]   at org.scalatest.OutcomeOf$.outcomeOf(OutcomeOf.scala:104)
25-Jul-2016 15:56:28 [info]   at org.scalatest.Transformer.apply(Transformer.scala:22)
25-Jul-2016 15:56:28 [info]   at org.scalatest.Transformer.apply(Transformer.scala:20)
25-Jul-2016 15:56:28 [info]   at org.scalatest.WordSpecLike$$anon$1.apply(WordSpecLike.scala:945)
25-Jul-2016 15:56:28 [info]   ...
25-Jul-2016 15:56:28 [info]   + Working Directory: /home/bamboo/bamboo-agent-home/xml-data/build-dir/CATS-CORE606-JOB1
25-Jul-2016 15:56:28 [info]   + File Pathing /home/bamboo/bamboo-agent-home/xml-data/build-dir/CATS-CORE606-JOB1/test/data/datasets/dataset-test-tags-round-two.json
25-Jul-2016 15:56:28 [info]   + Pretty JSON format
25-Jul-2016 15:56:28 [info]   + {
25-Jul-2016 15:56:28 [info]   "tags" : [ "Test 2", "Cool Stuff", "New Technology" ],
25-Jul-2016 15:56:28 [info]   "extractor_id" : "ncsa.cv.face"
25-Jul-2016 15:56:28 [info] }
25-Jul-2016 15:56:28 2016-07-25 15:56:28,346 - [DEBUG  ] - application - File1 is File:True
25-Jul-2016 15:56:28 [info] - must respond to the removeTag(id: UUID) function routed by POST /api/datasets/:id/removeTag *** FAILED ***
25-Jul-2016 15:56:28 [info]   scala.MatchError: None (of class scala.None$)
25-Jul-2016 15:56:28 [info]   at integration.DatasetsAPIAppSpec$$anonfun$2$$anonfun$apply$mcV$sp$14.apply$mcV$sp(DatasetsAPIAppSpec.scala:295)
25-Jul-2016 15:56:28 [info]   at integration.DatasetsAPIAppSpec$$anonfun$2$$anonfun$apply$mcV$sp$14.apply(DatasetsAPIAppSpec.scala:277)
25-Jul-2016 15:56:28 [info]   at integration.DatasetsAPIAppSpec$$anonfun$2$$anonfun$apply$mcV$sp$14.apply(DatasetsAPIAppSpec.scala:277)
25-Jul-2016 15:56:28 [info]   at org.scalatest.Transformer$$anonfun$apply$1.apply(Transformer.scala:22)
25-Jul-2016 15:56:28 [info]   at org.scalatest.Transformer$$anonfun$apply$1.apply(Transformer.scala:22)
25-Jul-2016 15:56:28 [info]   at org.scalatest.OutcomeOf$class.outcomeOf(OutcomeOf.scala:85)
25-Jul-2016 15:56:28 [info]   at org.scalatest.OutcomeOf$.outcomeOf(OutcomeOf.scala:104)
25-Jul-2016 15:56:28 [info]   at org.scalatest.Transformer.apply(Transformer.scala:22)
25-Jul-2016 15:56:28 [info]   at org.scalatest.Transformer.apply(Transformer.scala:20)
25-Jul-2016 15:56:28 [info]   at org.scalatest.WordSpecLike$$anon$1.apply(WordSpecLike.scala:945)
25-Jul-2016 15:56:28 [info]   ...
25-Jul-2016 15:56:28 [info]   + Working Directory: /home/bamboo/bamboo-agent-home/xml-data/build-dir/CATS-CORE606-JOB1
25-Jul-2016 15:56:28 [info]   + File Pathing /home/bamboo/bamboo-agent-home/xml-data/build-dir/CATS-CORE606-JOB1/test/data/datasets/dataset-test-tags-remove-one.json
25-Jul-2016 15:56:28 [info]   + Pretty JSON format
25-Jul-2016 15:56:28 [info]   + {
25-Jul-2016 15:56:28 [info]   "tags" : [ "Dataset" ]
25-Jul-2016 15:56:28 [info] }
25-Jul-2016 15:56:28 2016-07-25 15:56:28,370 - [DEBUG  ] - application - File1 is File:True
25-Jul-2016 15:56:28 [info] - must respond to the addMetadata(id: UUID) function routed by POST /api/datasets/:id/metadata *** FAILED ***
25-Jul-2016 15:56:28 [info]   scala.MatchError: None (of class scala.None$)
25-Jul-2016 15:56:28 [info]   at integration.DatasetsAPIAppSpec$$anonfun$2$$anonfun$apply$mcV$sp$15.apply$mcV$sp(DatasetsAPIAppSpec.scala:419)
25-Jul-2016 15:56:28 [info]   at integration.DatasetsAPIAppSpec$$anonfun$2$$anonfun$apply$mcV$sp$15.apply(DatasetsAPIAppSpec.scala:401)
25-Jul-2016 15:56:28 [info]   at integration.DatasetsAPIAppSpec$$anonfun$2$$anonfun$apply$mcV$sp$15.apply(DatasetsAPIAppSpec.scala:401)
25-Jul-2016 15:56:28 [info]   at org.scalatest.Transformer$$anonfun$apply$1.apply(Transformer.scala:22)
25-Jul-2016 15:56:28 [info]   at org.scalatest.Transformer$$anonfun$apply$1.apply(Transformer.scala:22)
25-Jul-2016 15:56:28 [info]   at org.scalatest.OutcomeOf$class.outcomeOf(OutcomeOf.scala:85)
25-Jul-2016 15:56:28 [info]   at org.scalatest.OutcomeOf$.outcomeOf(OutcomeOf.scala:104)
25-Jul-2016 15:56:28 [info]   at org.scalatest.Transformer.apply(Transformer.scala:22)
25-Jul-2016 15:56:28 [info]   at org.scalatest.Transformer.apply(Transformer.scala:20)
25-Jul-2016 15:56:28 [info]   at org.scalatest.WordSpecLike$$anon$1.apply(WordSpecLike.scala:945)
25-Jul-2016 15:56:28 [info]   ...
25-Jul-2016 15:56:28 [info]   + Working Directory: /home/bamboo/bamboo-agent-home/xml-data/build-dir/CATS-CORE606-JOB1
25-Jul-2016 15:56:28 [info]   + File Pathing /home/bamboo/bamboo-agent-home/xml-data/build-dir/CATS-CORE606-JOB1/test/data/datasets/dataset-test-general.json
25-Jul-2016 15:56:28 [info]   + Pretty JSON format
25-Jul-2016 15:56:28 [info]   + {
25-Jul-2016 15:56:28 [info]   "archive" : {
25-Jul-2016 15:56:28 [info]     "exclude" : [ "/foo/bar", "baz", "/*.test", "!/foo/bar/baz" ]
25-Jul-2016 15:56:28 [info]   },
25-Jul-2016 15:56:28 [info]   "Image" : "fid",
25-Jul-2016 15:56:28 [info]   "Format" : "JPEG(JointPhotographicExpertsGroupJFIFformat)",
25-Jul-2016 15:56:28 [info]   "Reason" : "DataSet Test Suite"
25-Jul-2016 15:56:28 [info] }
25-Jul-2016 15:56:28 2016-07-25 15:56:28,392 - [DEBUG  ] - application - File1 is File:True
25-Jul-2016 15:56:28 [info] - must respond to the addUserMetadata(id: UUID) function routed by POST /api/datasets/:id/usermetadata *** FAILED ***
25-Jul-2016 15:56:28 [info]   scala.MatchError: None (of class scala.None$)
25-Jul-2016 15:56:28 [info]   at integration.DatasetsAPIAppSpec$$anonfun$2$$anonfun$apply$mcV$sp$16.apply$mcV$sp(DatasetsAPIAppSpec.scala:444)
25-Jul-2016 15:56:28 [info]   at integration.DatasetsAPIAppSpec$$anonfun$2$$anonfun$apply$mcV$sp$16.apply(DatasetsAPIAppSpec.scala:426)
25-Jul-2016 15:56:28 [info]   at integration.DatasetsAPIAppSpec$$anonfun$2$$anonfun$apply$mcV$sp$16.apply(DatasetsAPIAppSpec.scala:426)
25-Jul-2016 15:56:28 [info]   at org.scalatest.Transformer$$anonfun$apply$1.apply(Transformer.scala:22)
25-Jul-2016 15:56:28 [info]   at org.scalatest.Transformer$$anonfun$apply$1.apply(Transformer.scala:22)
25-Jul-2016 15:56:28 [info]   at org.scalatest.OutcomeOf$class.outcomeOf(OutcomeOf.scala:85)
25-Jul-2016 15:56:28 [info]   at org.scalatest.OutcomeOf$.outcomeOf(OutcomeOf.scala:104)
25-Jul-2016 15:56:28 [info]   at org.scalatest.Transformer.apply(Transformer.scala:22)
25-Jul-2016 15:56:28 [info]   at org.scalatest.Transformer.apply(Transformer.scala:20)
25-Jul-2016 15:56:28 [info]   at org.scalatest.WordSpecLike$$anon$1.apply(WordSpecLike.scala:945)
25-Jul-2016 15:56:28 [info]   ...
25-Jul-2016 15:56:28 [info]   + Working Directory: /home/bamboo/bamboo-agent-home/xml-data/build-dir/CATS-CORE606-JOB1
25-Jul-2016 15:56:28 [info]   + File Pathing /home/bamboo/bamboo-agent-home/xml-data/build-dir/CATS-CORE606-JOB1/test/data/datasets/dataset-test-user.json
25-Jul-2016 15:56:28 [info]   + Pretty JSON format
25-Jul-2016 15:56:28 [info]   + {
25-Jul-2016 15:56:28 [info]   "Description" : "Dataset Zip file Json",
25-Jul-2016 15:56:28 [info]   "Items" : "Image files",
25-Jul-2016 15:56:28 [info]   "Other" : "Pretty Cool Huh?"
25-Jul-2016 15:56:28 [info] }
25-Jul-2016 15:56:28 [info] - must respond to the getUserMetadataJSON(id: UUID) function routed by GET /api/datasets/:id/usermetadata *** FAILED ***
25-Jul-2016 15:56:28 [info]   scala.MatchError: None (of class scala.None$)
25-Jul-2016 15:56:28 [info]   at integration.DatasetsAPIAppSpec$$anonfun$2$$anonfun$apply$mcV$sp$17.apply$mcV$sp(DatasetsAPIAppSpec.scala:453)
25-Jul-2016 15:56:28 [info]   at integration.DatasetsAPIAppSpec$$anonfun$2$$anonfun$apply$mcV$sp$17.apply(DatasetsAPIAppSpec.scala:452)
25-Jul-2016 15:56:28 [info]   at integration.DatasetsAPIAppSpec$$anonfun$2$$anonfun$apply$mcV$sp$17.apply(DatasetsAPIAppSpec.scala:452)
25-Jul-2016 15:56:28 [info]   at org.scalatest.Transformer$$anonfun$apply$1.apply(Transformer.scala:22)
25-Jul-2016 15:56:28 [info]   at org.scalatest.Transformer$$anonfun$apply$1.apply(Transformer.scala:22)
25-Jul-2016 15:56:28 [info]   at org.scalatest.OutcomeOf$class.outcomeOf(OutcomeOf.scala:85)
25-Jul-2016 15:56:28 [info]   at org.scalatest.OutcomeOf$.outcomeOf(OutcomeOf.scala:104)
25-Jul-2016 15:56:28 [info]   at org.scalatest.Transformer.apply(Transformer.scala:22)
25-Jul-2016 15:56:28 [info]   at org.scalatest.Transformer.apply(Transformer.scala:20)
25-Jul-2016 15:56:28 [info]   at org.scalatest.WordSpecLike$$anon$1.apply(WordSpecLike.scala:945)
25-Jul-2016 15:56:28 [info]   ...
25-Jul-2016 15:56:28 [info] - must respond to the getTechnicalMetadataJSON(id: UUID) function routed by GET /api/datasets/:id/technicalmetadatajson *** FAILED ***
25-Jul-2016 15:56:28 [info]   scala.MatchError: None (of class scala.None$)
25-Jul-2016 15:56:28 [info]   at integration.DatasetsAPIAppSpec$$anonfun$2$$anonfun$apply$mcV$sp$18.apply$mcV$sp(DatasetsAPIAppSpec.scala:465)
25-Jul-2016 15:56:28 [info]   at integration.DatasetsAPIAppSpec$$anonfun$2$$anonfun$apply$mcV$sp$18.apply(DatasetsAPIAppSpec.scala:464)
25-Jul-2016 15:56:28 [info]   at integration.DatasetsAPIAppSpec$$anonfun$2$$anonfun$apply$mcV$sp$18.apply(DatasetsAPIAppSpec.scala:464)
25-Jul-2016 15:56:28 [info]   at org.scalatest.Transformer$$anonfun$apply$1.apply(Transformer.scala:22)
25-Jul-2016 15:56:28 [info]   at org.scalatest.Transformer$$anonfun$apply$1.apply(Transformer.scala:22)
25-Jul-2016 15:56:28 [info]   at org.scalatest.OutcomeOf$class.outcomeOf(OutcomeOf.scala:85)
25-Jul-2016 15:56:28 [info]   at org.scalatest.OutcomeOf$.outcomeOf(OutcomeOf.scala:104)
25-Jul-2016 15:56:28 [info]   at org.scalatest.Transformer.apply(Transformer.scala:22)
25-Jul-2016 15:56:28 [info]   at org.scalatest.Transformer.apply(Transformer.scala:20)
25-Jul-2016 15:56:28 [info]   at org.scalatest.WordSpecLike$$anon$1.apply(WordSpecLike.scala:945)
25-Jul-2016 15:56:28 [info]   ...
25-Jul-2016 15:56:28 2016-07-25 15:56:28,436 - [DEBUG  ] - application - File1 is File:True
25-Jul-2016 15:56:28 2016-07-25 15:56:28,453 - [DEBUG  ] - application - Getting value for tos.date
25-Jul-2016 15:56:28 2016-07-25 15:56:28,455 - [DEBUG  ] - application - Searching datasets' metadata for search tree.
25-Jul-2016 15:56:28 2016-07-25 15:56:28,456 - [DEBUG  ] - application - thejsson: {"Reason":".*Suite.*"}
25-Jul-2016 15:56:28 2016-07-25 15:56:28,457 - [DEBUG  ] - application - top: {Reason=.*Suite.*}
25-Jul-2016 15:56:28 2016-07-25 15:56:28,458 - [DEBUG  ] - application - req: {Reason=.*Suite.*}
25-Jul-2016 15:56:28 2016-07-25 15:56:28,467 - [DEBUG  ] - application - thequery: { "$and" : [ { "$or" : [ { "userMetadata.Reason" : ".*Suite.*"} , { "metadata.Reason" : ".*Suite.*"} , { "datasetXmlMetadata.xmlMetadata.Reason" : ".*Suite.*"}]}]}
25-Jul-2016 15:56:28 2016-07-25 15:56:28,471 - [DEBUG  ] - application - Search completed. Returning datasets list.
25-Jul-2016 15:56:28 2016-07-25 15:56:28,472 - [DEBUG  ] - application - thelist: []
25-Jul-2016 15:56:28 [info] - must respond to the searchDatasetsGeneralMetadata() function routed by POST /api/datasets/searchmetadata 
25-Jul-2016 15:56:28 [info]   + Working Directory: /home/bamboo/bamboo-agent-home/xml-data/build-dir/CATS-CORE606-JOB1
25-Jul-2016 15:56:28 [info]   + File Pathing /home/bamboo/bamboo-agent-home/xml-data/build-dir/CATS-CORE606-JOB1/test/data/datasets/dataset-search-general.json
25-Jul-2016 15:56:28 [info]   + Pretty JSON format
25-Jul-2016 15:56:28 [info]   + {
25-Jul-2016 15:56:28 [info]   "Reason" : ".*Suite.*"
25-Jul-2016 15:56:28 [info] }
25-Jul-2016 15:56:28 [info]   + Status=200
25-Jul-2016 15:56:28 [info]   + contentType=Some(application/json)
25-Jul-2016 15:56:28 [info]   + content[]
25-Jul-2016 15:56:28 2016-07-25 15:56:28,483 - [DEBUG  ] - application - File1 is File:True
25-Jul-2016 15:56:28 2016-07-25 15:56:28,498 - [DEBUG  ] - application - Getting value for tos.date
25-Jul-2016 15:56:28 2016-07-25 15:56:28,500 - [DEBUG  ] - application - Searching datasets' user metadata for search tree.
25-Jul-2016 15:56:28 2016-07-25 15:56:28,501 - [DEBUG  ] - application - thejsson: {"Other":".*Pretty Cool.*"}
25-Jul-2016 15:56:28 2016-07-25 15:56:28,502 - [DEBUG  ] - application - top: {Other=.*Pretty Cool.*}
25-Jul-2016 15:56:28 2016-07-25 15:56:28,502 - [DEBUG  ] - application - req: {Other=.*Pretty Cool.*}
25-Jul-2016 15:56:28 2016-07-25 15:56:28,503 - [DEBUG  ] - application - thequery: { "$and" : [ { "userMetadata.Other" : ".*Pretty Cool.*"}]}
25-Jul-2016 15:56:28 2016-07-25 15:56:28,505 - [DEBUG  ] - application - Search completed. Returning datasets list.
25-Jul-2016 15:56:28 2016-07-25 15:56:28,507 - [DEBUG  ] - application - thelist: []
25-Jul-2016 15:56:28 [info] - must respond to the searchDatasetsUserMetadata() function routed by POST /api/datasets/searchmetadata 
25-Jul-2016 15:56:28 [info]   + Working Directory: /home/bamboo/bamboo-agent-home/xml-data/build-dir/CATS-CORE606-JOB1
25-Jul-2016 15:56:28 [info]   + File Pathing /home/bamboo/bamboo-agent-home/xml-data/build-dir/CATS-CORE606-JOB1/test/data/datasets/dataset-search-user.json
25-Jul-2016 15:56:28 [info]   + Pretty JSON format
25-Jul-2016 15:56:28 [info]   + {
25-Jul-2016 15:56:28 [info]   "Other" : ".*Pretty Cool.*"
25-Jul-2016 15:56:28 [info] }
25-Jul-2016 15:56:28 [info]   + Status=200
25-Jul-2016 15:56:28 [info]   + contentType=Some(application/json)
25-Jul-2016 15:56:28 [info]   + content[]
25-Jul-2016 15:56:28 [info] - must respond to the deleteDataset(id:UUID) function routed by DELETE /api/datasets/:id   *** FAILED ***
25-Jul-2016 15:56:28 [info]   scala.MatchError: None (of class scala.None$)
25-Jul-2016 15:56:28 [info]   at integration.DatasetsAPIAppSpec$$anonfun$2$$anonfun$apply$mcV$sp$21.apply$mcV$sp(DatasetsAPIAppSpec.scala:574)
25-Jul-2016 15:56:28 [info]   at integration.DatasetsAPIAppSpec$$anonfun$2$$anonfun$apply$mcV$sp$21.apply(DatasetsAPIAppSpec.scala:573)
25-Jul-2016 15:56:28 [info]   at integration.DatasetsAPIAppSpec$$anonfun$2$$anonfun$apply$mcV$sp$21.apply(DatasetsAPIAppSpec.scala:573)
25-Jul-2016 15:56:28 [info]   at org.scalatest.Transformer$$anonfun$apply$1.apply(Transformer.scala:22)
25-Jul-2016 15:56:28 [info]   at org.scalatest.Transformer$$anonfun$apply$1.apply(Transformer.scala:22)
25-Jul-2016 15:56:28 [info]   at org.scalatest.OutcomeOf$class.outcomeOf(OutcomeOf.scala:85)
25-Jul-2016 15:56:28 [info]   at org.scalatest.OutcomeOf$.outcomeOf(OutcomeOf.scala:104)
25-Jul-2016 15:56:28 [info]   at org.scalatest.Transformer.apply(Transformer.scala:22)
25-Jul-2016 15:56:28 [info]   at org.scalatest.Transformer.apply(Transformer.scala:20)
25-Jul-2016 15:56:28 [info]   at org.scalatest.WordSpecLike$$anon$1.apply(WordSpecLike.scala:945)
25-Jul-2016 15:56:28 [info]   ...
25-Jul-2016 15:56:28 2016-07-25 15:56:28,602 - [DEBUG  ] - application - File1 is File:True
25-Jul-2016 15:56:28 [info] CollectionsAPIAppSpec:
25-Jul-2016 15:56:28 [info] The Collections API Spec
25-Jul-2016 15:56:28 [info] - must provide a FakeApplication
25-Jul-2016 15:56:28 [info] - must make the FakeApplication available implicitly
25-Jul-2016 15:56:28 [info] - must start the FakeApplication
25-Jul-2016 15:56:28 [info] The Collections API Spec
25-Jul-2016 15:56:28 2016-07-25 15:56:28,675 - [DEBUG  ] - application - Getting value for tos.date
25-Jul-2016 15:56:28 2016-07-25 15:56:28,676 - [DEBUG  ] - application - Creating new collection
25-Jul-2016 15:56:28 [info] - must respond to the createCollection() function routed by POST /api/collections for Collection 1
25-Jul-2016 15:56:28 [info]   + Working Directory: /home/bamboo/bamboo-agent-home/xml-data/build-dir/CATS-CORE606-JOB1
25-Jul-2016 15:56:28 [info]   + File Pathing /home/bamboo/bamboo-agent-home/xml-data/build-dir/CATS-CORE606-JOB1/test/data/collections/data-test-collection.json
25-Jul-2016 15:56:28 [info]   + Pretty JSON format
25-Jul-2016 15:56:28 [info]   + {
25-Jul-2016 15:56:28 [info]   "description" : "Collection 1 Tests Description",
25-Jul-2016 15:56:28 [info]   "name" : "Collection 1 Test Suite",
25-Jul-2016 15:56:28 [info]   "space" : "default"
25-Jul-2016 15:56:28 [info] }
25-Jul-2016 15:56:28 [info]   + Status=200
25-Jul-2016 15:56:28 [info]   + contentType=Some(application/json)
25-Jul-2016 15:56:28 [info]   + content{"id":"57967cfc60b2dad13fd4fbc2"}
25-Jul-2016 15:56:28 2016-07-25 15:56:28,752 - [DEBUG  ] - application - File1 is File:True
25-Jul-2016 15:56:28 2016-07-25 15:56:28,763 - [DEBUG  ] - application - Getting value for tos.date
25-Jul-2016 15:56:28 2016-07-25 15:56:28,764 - [DEBUG  ] - application - Creating new collection
25-Jul-2016 15:56:28 [info] - must respond to the createCollection() function routed by POST /api/collections for Collection 2
25-Jul-2016 15:56:28 [info]   + Working Directory: /home/bamboo/bamboo-agent-home/xml-data/build-dir/CATS-CORE606-JOB1
25-Jul-2016 15:56:28 [info]   + File Pathing /home/bamboo/bamboo-agent-home/xml-data/build-dir/CATS-CORE606-JOB1/test/data/collections/data-test-collection-1.json
25-Jul-2016 15:56:28 [info]   + Pretty JSON format
25-Jul-2016 15:56:28 [info]   + {
25-Jul-2016 15:56:28 [info]   "description" : "Collection 2 Tests Description",
25-Jul-2016 15:56:28 [info]   "name" : "Collection 2 Test Suite",
25-Jul-2016 15:56:28 [info]   "space" : "default"
25-Jul-2016 15:56:28 [info] }
25-Jul-2016 15:56:28 [info]   + Status=200
25-Jul-2016 15:56:28 [info]   + contentType=Some(application/json)
25-Jul-2016 15:56:28 [info]   + content{"id":"57967cfc60b2dad13fd4fbc3"}
25-Jul-2016 15:56:28 2016-07-25 15:56:28,783 - [DEBUG  ] - application - File1 is File:True
25-Jul-2016 15:56:29 2016-07-25 15:56:29,022 - [DEBUG  ] - application - Getting value for tos.date
25-Jul-2016 15:56:29 2016-07-25 15:56:29,032 - [INFO   ] - application - created file 57967cfd60b2dad13fd4fbc5
25-Jul-2016 15:56:29 2016-07-25 15:56:29,037 - [DEBUG  ] - application - Uploading file dataset-image.zip
25-Jul-2016 15:56:29 2016-07-25 15:56:29,038 - [DEBUG  ] - application - Getting value for tos.date
25-Jul-2016 15:56:29 2016-07-25 15:56:29,038 - [DEBUG  ] - application - --- API Creating new dataset ----
25-Jul-2016 15:56:29 2016-07-25 15:56:29,054 - [DEBUG  ] - application - tagStr=[]
25-Jul-2016 15:56:29 2016-07-25 15:56:29,055 - [DEBUG  ] - application - commentStr=[]
25-Jul-2016 15:56:29 2016-07-25 15:56:29,055 - [DEBUG  ] - application - usrmd={}
25-Jul-2016 15:56:29 2016-07-25 15:56:29,056 - [DEBUG  ] - application - techmd={}
25-Jul-2016 15:56:29 2016-07-25 15:56:29,056 - [DEBUG  ] - application - xmlmd={ }
25-Jul-2016 15:56:29 [play-akka.actor.default-dispatcher-9] INFO  elasticsearch.plugins  - [Kohl Harder Boulder Man] loaded [], sites []
25-Jul-2016 15:56:29 2016-07-25 15:56:29,202 - [INFO   ] - application - Uploading Completed
25-Jul-2016 15:56:29 2016-07-25 15:56:29,203 - [DEBUG  ] - application - Sending message ExtractorMessage(57967cfd60b2dad13fd4fbc5,57967cfd60b2dad13fd4fbc5,https://,clowder.file.multi.files-zipped,Map(filename -> dataset-image.zip),3797692,null,,phuong-test)
25-Jul-2016 15:56:34 [info] - must respond to the createDataset() function routed by POST /api/datasets for Dataset 1 Creation *** FAILED ***
25-Jul-2016 15:56:34 [info]   java.util.concurrent.TimeoutException: Futures timed out after [5 seconds]
25-Jul-2016 15:56:34 [info]   at scala.concurrent.impl.Promise$DefaultPromise.ready(Promise.scala:219)
25-Jul-2016 15:56:34 [info]   at scala.concurrent.impl.Promise$DefaultPromise.result(Promise.scala:223)
25-Jul-2016 15:56:34 [info]   at scala.concurrent.Await$$anonfun$result$1.apply(package.scala:107)
25-Jul-2016 15:56:34 [info]   at scala.concurrent.BlockContext$DefaultBlockContext$.blockOn(BlockContext.scala:53)
25-Jul-2016 15:56:34 [info]   at scala.concurrent.Await$.result(package.scala:107)
25-Jul-2016 15:56:34 [info]   at play.api.test.ResultExtractors$class.status(Helpers.scala:324)
25-Jul-2016 15:56:34 [info]   at play.api.test.Helpers$.status(Helpers.scala:364)
25-Jul-2016 15:56:34 [info]   at integration.CollectionsAPIAppSpec$$anonfun$2$$anonfun$apply$mcV$sp$6.apply$mcV$sp(CollectionsAPIAppSpec.scala:162)
25-Jul-2016 15:56:34 [info]   at integration.CollectionsAPIAppSpec$$anonfun$2$$anonfun$apply$mcV$sp$6.apply(CollectionsAPIAppSpec.scala:142)
25-Jul-2016 15:56:34 [info]   at integration.CollectionsAPIAppSpec$$anonfun$2$$anonfun$apply$mcV$sp$6.apply(CollectionsAPIAppSpec.scala:142)
25-Jul-2016 15:56:34 [info]   ...
25-Jul-2016 15:56:34 [info]   + Working Directory: /home/bamboo/bamboo-agent-home/xml-data/build-dir/CATS-CORE606-JOB1
25-Jul-2016 15:56:34 2016-07-25 15:56:34,047 - [DEBUG  ] - application - File1 is File:True
25-Jul-2016 15:56:39 [info] - must respond to the createDataset() function routed by POST /api/datasets for Dataset 2 Creation *** FAILED ***
25-Jul-2016 15:56:39 [info]   java.util.concurrent.TimeoutException: Futures timed out after [5 seconds]
25-Jul-2016 15:56:39 [info]   at scala.concurrent.impl.Promise$DefaultPromise.ready(Promise.scala:219)
25-Jul-2016 15:56:39 [info]   at scala.concurrent.impl.Promise$DefaultPromise.result(Promise.scala:223)
25-Jul-2016 15:56:39 [info]   at scala.concurrent.Await$$anonfun$result$1.apply(package.scala:107)
25-Jul-2016 15:56:39 [info]   at scala.concurrent.BlockContext$DefaultBlockContext$.blockOn(BlockContext.scala:53)
25-Jul-2016 15:56:39 [info]   at scala.concurrent.Await$.result(package.scala:107)
25-Jul-2016 15:56:39 [info]   at play.api.test.ResultExtractors$class.contentAsBytes(Helpers.scala:314)
25-Jul-2016 15:56:39 [info]   at play.api.test.Helpers$.contentAsBytes(Helpers.scala:364)
25-Jul-2016 15:56:39 [info]   at play.api.test.ResultExtractors$class.contentAsString(Helpers.scala:308)
25-Jul-2016 15:56:39 [info]   at play.api.test.Helpers$.contentAsString(Helpers.scala:364)
25-Jul-2016 15:56:39 [info]   at integration.CollectionsAPIAppSpec$$anonfun$2$$anonfun$apply$mcV$sp$7.apply$mcV$sp(CollectionsAPIAppSpec.scala:181)
25-Jul-2016 15:56:39 [info]   ...
25-Jul-2016 15:56:39 [info]   + Working Directory: /home/bamboo/bamboo-agent-home/xml-data/build-dir/CATS-CORE606-JOB1
25-Jul-2016 15:56:39 [info] - must respond to the attachDataset(coll_id:UUID, ds_id:UUID) function routed by POST /api/collections/:coll_id/datasets/:ds_id for dataset 1 *** FAILED ***
25-Jul-2016 15:56:39 [info]   java.util.NoSuchElementException: None.get
25-Jul-2016 15:56:39 [info]   at scala.None$.get(Option.scala:313)
25-Jul-2016 15:56:39 [info]   at scala.None$.get(Option.scala:311)
25-Jul-2016 15:56:39 [info]   at integration.CollectionsAPIAppSpec$$anonfun$2$$anonfun$apply$mcV$sp$8.apply$mcV$sp(CollectionsAPIAppSpec.scala:203)
25-Jul-2016 15:56:39 [info]   at integration.CollectionsAPIAppSpec$$anonfun$2$$anonfun$apply$mcV$sp$8.apply(CollectionsAPIAppSpec.scala:201)
25-Jul-2016 15:56:39 [info]   at integration.CollectionsAPIAppSpec$$anonfun$2$$anonfun$apply$mcV$sp$8.apply(CollectionsAPIAppSpec.scala:201)
25-Jul-2016 15:56:39 [info]   at org.scalatest.Transformer$$anonfun$apply$1.apply(Transformer.scala:22)
25-Jul-2016 15:56:39 [info]   at org.scalatest.Transformer$$anonfun$apply$1.apply(Transformer.scala:22)
25-Jul-2016 15:56:39 [info]   at org.scalatest.OutcomeOf$class.outcomeOf(OutcomeOf.scala:85)
25-Jul-2016 15:56:39 [info]   at org.scalatest.OutcomeOf$.outcomeOf(OutcomeOf.scala:104)
25-Jul-2016 15:56:39 [info]   at org.scalatest.Transformer.apply(Transformer.scala:22)
25-Jul-2016 15:56:39 [info]   ...
25-Jul-2016 15:56:43 2016-07-25 15:56:43,927 - [DEBUG  ] - application - --- ElasticSearch Client is being created----
25-Jul-2016 15:56:43 2016-07-25 15:56:43,932 - [DEBUG  ] - application - Index "data"  is being created if it does not exist ---
25-Jul-2016 15:56:44 2016-07-25 15:56:44,074 - [ERROR  ] - application - Error connecting to elasticsearch: org.elasticsearch.client.transport.NoNodeAvailableException: None of the configured nodes are available: []
25-Jul-2016 15:56:44 [info] - must respond to the listInCollection(coll_id: UUID) function routed by GET /api/collections/:coll_id/getDatasets *** FAILED ***
25-Jul-2016 15:56:44 [info]   java.util.concurrent.TimeoutException: Futures timed out after [5 seconds]
25-Jul-2016 15:56:44 [info]   at scala.concurrent.impl.Promise$DefaultPromise.ready(Promise.scala:219)
25-Jul-2016 15:56:44 [info]   at scala.concurrent.impl.Promise$DefaultPromise.result(Promise.scala:223)
25-Jul-2016 15:56:44 [info]   at scala.concurrent.Await$$anonfun$result$1.apply(package.scala:107)
25-Jul-2016 15:56:44 [info]   at scala.concurrent.BlockContext$DefaultBlockContext$.blockOn(BlockContext.scala:53)
25-Jul-2016 15:56:44 [info]   at scala.concurrent.Await$.result(package.scala:107)
25-Jul-2016 15:56:44 [info]   at play.api.test.ResultExtractors$class.status(Helpers.scala:324)
25-Jul-2016 15:56:44 [info]   at play.api.test.Helpers$.status(Helpers.scala:364)
25-Jul-2016 15:56:44 [info]   at integration.CollectionsAPIAppSpec$$anonfun$2$$anonfun$apply$mcV$sp$9.apply$mcV$sp(CollectionsAPIAppSpec.scala:215)
25-Jul-2016 15:56:44 [info]   at integration.CollectionsAPIAppSpec$$anonfun$2$$anonfun$apply$mcV$sp$9.apply(CollectionsAPIAppSpec.scala:213)
25-Jul-2016 15:56:44 [info]   at integration.CollectionsAPIAppSpec$$anonfun$2$$anonfun$apply$mcV$sp$9.apply(CollectionsAPIAppSpec.scala:213)
25-Jul-2016 15:56:44 [info]   ...
25-Jul-2016 15:56:49 [info] - must respond to the listOutsideCollection(coll_id: UUID) function routed by GET /api/datasets/listOutsideCollection/:coll_id *** FAILED ***
25-Jul-2016 15:56:49 [info]   java.util.concurrent.TimeoutException: Futures timed out after [5 seconds]
25-Jul-2016 15:56:49 [info]   at scala.concurrent.impl.Promise$DefaultPromise.ready(Promise.scala:219)
25-Jul-2016 15:56:49 [info]   at scala.concurrent.impl.Promise$DefaultPromise.result(Promise.scala:223)
25-Jul-2016 15:56:49 [info]   at scala.concurrent.Await$$anonfun$result$1.apply(package.scala:107)
25-Jul-2016 15:56:49 [info]   at scala.concurrent.BlockContext$DefaultBlockContext$.blockOn(BlockContext.scala:53)
25-Jul-2016 15:56:49 [info]   at scala.concurrent.Await$.result(package.scala:107)
25-Jul-2016 15:56:49 [info]   at play.api.test.ResultExtractors$class.status(Helpers.scala:324)
25-Jul-2016 15:56:49 [info]   at play.api.test.Helpers$.status(Helpers.scala:364)
25-Jul-2016 15:56:49 [info]   at integration.CollectionsAPIAppSpec$$anonfun$2$$anonfun$apply$mcV$sp$10.apply$mcV$sp(CollectionsAPIAppSpec.scala:228)
25-Jul-2016 15:56:49 [info]   at integration.CollectionsAPIAppSpec$$anonfun$2$$anonfun$apply$mcV$sp$10.apply(CollectionsAPIAppSpec.scala:226)
25-Jul-2016 15:56:49 [info]   at integration.CollectionsAPIAppSpec$$anonfun$2$$anonfun$apply$mcV$sp$10.apply(CollectionsAPIAppSpec.scala:226)
25-Jul-2016 15:56:49 [info]   ...
25-Jul-2016 15:56:49 [info] - must respond to the attachDataset(coll_id:UUID, ds_id:UUID) function routed by POST /api/collections/:coll_id/datasets/:ds_id for dataset 2 *** FAILED ***
25-Jul-2016 15:56:49 [info]   java.util.NoSuchElementException: None.get
25-Jul-2016 15:56:49 [info]   at scala.None$.get(Option.scala:313)
25-Jul-2016 15:56:49 [info]   at scala.None$.get(Option.scala:311)
25-Jul-2016 15:56:49 [info]   at integration.CollectionsAPIAppSpec$$anonfun$2$$anonfun$apply$mcV$sp$11.apply$mcV$sp(CollectionsAPIAppSpec.scala:243)
25-Jul-2016 15:56:49 [info]   at integration.CollectionsAPIAppSpec$$anonfun$2$$anonfun$apply$mcV$sp$11.apply(CollectionsAPIAppSpec.scala:240)
25-Jul-2016 15:56:49 [info]   at integration.CollectionsAPIAppSpec$$anonfun$2$$anonfun$apply$mcV$sp$11.apply(CollectionsAPIAppSpec.scala:240)
25-Jul-2016 15:56:49 [info]   at org.scalatest.Transformer$$anonfun$apply$1.apply(Transformer.scala:22)
25-Jul-2016 15:56:49 [info]   at org.scalatest.Transformer$$anonfun$apply$1.apply(Transformer.scala:22)
25-Jul-2016 15:56:49 [info]   at org.scalatest.OutcomeOf$class.outcomeOf(OutcomeOf.scala:85)
25-Jul-2016 15:56:49 [info]   at org.scalatest.OutcomeOf$.outcomeOf(OutcomeOf.scala:104)
25-Jul-2016 15:56:49 [info]   at org.scalatest.Transformer.apply(Transformer.scala:22)
25-Jul-2016 15:56:49 [info]   ...
25-Jul-2016 15:56:49 [info] - must respond to the removeDataset(coll_id:UUID, ds_id:UUID, ignoreNotFound) function routed by DELETE /api/collections/:coll_id/datasets/:ds_id for dataset 2 *** FAILED ***
25-Jul-2016 15:56:49 [info]   java.util.NoSuchElementException: None.get
25-Jul-2016 15:56:49 [info]   at scala.None$.get(Option.scala:313)
25-Jul-2016 15:56:49 [info]   at scala.None$.get(Option.scala:311)
25-Jul-2016 15:56:49 [info]   at integration.CollectionsAPIAppSpec$$anonfun$2$$anonfun$apply$mcV$sp$12.apply$mcV$sp(CollectionsAPIAppSpec.scala:256)
25-Jul-2016 15:56:49 [info]   at integration.CollectionsAPIAppSpec$$anonfun$2$$anonfun$apply$mcV$sp$12.apply(CollectionsAPIAppSpec.scala:254)
25-Jul-2016 15:56:49 [info]   at integration.CollectionsAPIAppSpec$$anonfun$2$$anonfun$apply$mcV$sp$12.apply(CollectionsAPIAppSpec.scala:254)
25-Jul-2016 15:56:49 [info]   at org.scalatest.Transformer$$anonfun$apply$1.apply(Transformer.scala:22)
25-Jul-2016 15:56:49 [info]   at org.scalatest.Transformer$$anonfun$apply$1.apply(Transformer.scala:22)
25-Jul-2016 15:56:49 [info]   at org.scalatest.OutcomeOf$class.outcomeOf(OutcomeOf.scala:85)
25-Jul-2016 15:56:49 [info]   at org.scalatest.OutcomeOf$.outcomeOf(OutcomeOf.scala:104)
25-Jul-2016 15:56:49 [info]   at org.scalatest.Transformer.apply(Transformer.scala:22)
25-Jul-2016 15:56:49 [info]   ...
25-Jul-2016 15:56:49 [info] - must respond to the removeDataset(coll_id:UUID, ds_id:UUID, ignoreNoteFound) function routed by POST /api/collections/:coll_id/datasets/:ds_id/:ignoreNotFound for dataset 2 *** FAILED ***
25-Jul-2016 15:56:49 [info]   java.util.NoSuchElementException: None.get
25-Jul-2016 15:56:49 [info]   at scala.None$.get(Option.scala:313)
25-Jul-2016 15:56:49 [info]   at scala.None$.get(Option.scala:311)
25-Jul-2016 15:56:49 [info]   at integration.CollectionsAPIAppSpec$$anonfun$2$$anonfun$apply$mcV$sp$13.apply$mcV$sp(CollectionsAPIAppSpec.scala:270)
25-Jul-2016 15:56:49 [info]   at integration.CollectionsAPIAppSpec$$anonfun$2$$anonfun$apply$mcV$sp$13.apply(CollectionsAPIAppSpec.scala:267)
25-Jul-2016 15:56:49 [info]   at integration.CollectionsAPIAppSpec$$anonfun$2$$anonfun$apply$mcV$sp$13.apply(CollectionsAPIAppSpec.scala:267)
25-Jul-2016 15:56:49 [info]   at org.scalatest.Transformer$$anonfun$apply$1.apply(Transformer.scala:22)
25-Jul-2016 15:56:49 [info]   at org.scalatest.Transformer$$anonfun$apply$1.apply(Transformer.scala:22)
25-Jul-2016 15:56:49 [info]   at org.scalatest.OutcomeOf$class.outcomeOf(OutcomeOf.scala:85)
25-Jul-2016 15:56:49 [info]   at org.scalatest.OutcomeOf$.outcomeOf(OutcomeOf.scala:104)
25-Jul-2016 15:56:49 [info]   at org.scalatest.Transformer.apply(Transformer.scala:22)
25-Jul-2016 15:56:49 [info]   ...
25-Jul-2016 15:56:49 [info] - must respond to the deleteDataset(id:UUID) function routed by DELETE /api/datasets/:id for Dataset 1  *** FAILED ***
25-Jul-2016 15:56:49 [info]   scala.MatchError: None (of class scala.None$)
25-Jul-2016 15:56:49 [info]   at integration.CollectionsAPIAppSpec$$anonfun$2$$anonfun$apply$mcV$sp$14.apply$mcV$sp(CollectionsAPIAppSpec.scala:283)
25-Jul-2016 15:56:49 [info]   at integration.CollectionsAPIAppSpec$$anonfun$2$$anonfun$apply$mcV$sp$14.apply(CollectionsAPIAppSpec.scala:282)
25-Jul-2016 15:56:49 [info]   at integration.CollectionsAPIAppSpec$$anonfun$2$$anonfun$apply$mcV$sp$14.apply(CollectionsAPIAppSpec.scala:282)
25-Jul-2016 15:56:49 [info]   at org.scalatest.Transformer$$anonfun$apply$1.apply(Transformer.scala:22)
25-Jul-2016 15:56:49 [info]   at org.scalatest.Transformer$$anonfun$apply$1.apply(Transformer.scala:22)
25-Jul-2016 15:56:49 [info]   at org.scalatest.OutcomeOf$class.outcomeOf(OutcomeOf.scala:85)
25-Jul-2016 15:56:49 [info]   at org.scalatest.OutcomeOf$.outcomeOf(OutcomeOf.scala:104)
25-Jul-2016 15:56:49 [info]   at org.scalatest.Transformer.apply(Transformer.scala:22)
25-Jul-2016 15:56:49 [info]   at org.scalatest.Transformer.apply(Transformer.scala:20)
25-Jul-2016 15:56:49 [info]   at org.scalatest.WordSpecLike$$anon$1.apply(WordSpecLike.scala:945)
25-Jul-2016 15:56:49 [info]   ...
25-Jul-2016 15:56:49 [info] - must respond to the deleteDataset(id:UUID) function routed by DELETE /api/datasets/:id for Dataset 2  *** FAILED ***
25-Jul-2016 15:56:49 [info]   scala.MatchError: None (of class scala.None$)
25-Jul-2016 15:56:49 [info]   at integration.CollectionsAPIAppSpec$$anonfun$2$$anonfun$apply$mcV$sp$15.apply$mcV$sp(CollectionsAPIAppSpec.scala:295)
25-Jul-2016 15:56:49 [info]   at integration.CollectionsAPIAppSpec$$anonfun$2$$anonfun$apply$mcV$sp$15.apply(CollectionsAPIAppSpec.scala:294)
25-Jul-2016 15:56:49 [info]   at integration.CollectionsAPIAppSpec$$anonfun$2$$anonfun$apply$mcV$sp$15.apply(CollectionsAPIAppSpec.scala:294)
25-Jul-2016 15:56:49 [info]   at org.scalatest.Transformer$$anonfun$apply$1.apply(Transformer.scala:22)
25-Jul-2016 15:56:49 [info]   at org.scalatest.Transformer$$anonfun$apply$1.apply(Transformer.scala:22)
25-Jul-2016 15:56:49 [info]   at org.scalatest.OutcomeOf$class.outcomeOf(OutcomeOf.scala:85)
25-Jul-2016 15:56:49 [info]   at org.scalatest.OutcomeOf$.outcomeOf(OutcomeOf.scala:104)
25-Jul-2016 15:56:49 [info]   at org.scalatest.Transformer.apply(Transformer.scala:22)
25-Jul-2016 15:56:49 [info]   at org.scalatest.Transformer.apply(Transformer.scala:20)
25-Jul-2016 15:56:49 [info]   at org.scalatest.WordSpecLike$$anon$1.apply(WordSpecLike.scala:945)
25-Jul-2016 15:56:49 [info]   ...
25-Jul-2016 15:56:53 2016-07-25 15:56:53,561 - [DEBUG  ] - application - --- ElasticSearch Client is being created----
25-Jul-2016 15:56:53 2016-07-25 15:56:53,565 - [DEBUG  ] - application - Index "data"  is being created if it does not exist ---
25-Jul-2016 15:56:53 2016-07-25 15:56:53,567 - [ERROR  ] - application - Error connecting to elasticsearch: org.elasticsearch.client.transport.NoNodeAvailableException: None of the configured nodes are available: []
25-Jul-2016 15:56:54 [info] - must respond to the listCollections() function routed by GET /api/collections *** FAILED ***
25-Jul-2016 15:56:54 [info]   java.util.concurrent.TimeoutException: Futures timed out after [5 seconds]
25-Jul-2016 15:56:54 [info]   at scala.concurrent.impl.Promise$DefaultPromise.ready(Promise.scala:219)
25-Jul-2016 15:56:54 [info]   at scala.concurrent.impl.Promise$DefaultPromise.result(Promise.scala:223)
25-Jul-2016 15:56:54 [info]   at scala.concurrent.Await$$anonfun$result$1.apply(package.scala:107)
25-Jul-2016 15:56:54 [info]   at scala.concurrent.BlockContext$DefaultBlockContext$.blockOn(BlockContext.scala:53)
25-Jul-2016 15:56:54 [info]   at scala.concurrent.Await$.result(package.scala:107)
25-Jul-2016 15:56:54 [info]   at play.api.test.ResultExtractors$class.status(Helpers.scala:324)
25-Jul-2016 15:56:54 [info]   at play.api.test.Helpers$.status(Helpers.scala:364)
25-Jul-2016 15:56:54 [info]   at integration.CollectionsAPIAppSpec$$anonfun$2$$anonfun$apply$mcV$sp$16.apply$mcV$sp(CollectionsAPIAppSpec.scala:308)
25-Jul-2016 15:56:54 [info]   at integration.CollectionsAPIAppSpec$$anonfun$2$$anonfun$apply$mcV$sp$16.apply(CollectionsAPIAppSpec.scala:306)
25-Jul-2016 15:56:54 [info]   at integration.CollectionsAPIAppSpec$$anonfun$2$$anonfun$apply$mcV$sp$16.apply(CollectionsAPIAppSpec.scala:306)
25-Jul-2016 15:56:54 [info]   ...
25-Jul-2016 15:56:59 [info] - must respond to the listCollections() function routed by GET /api/collections/list *** FAILED ***
25-Jul-2016 15:56:59 [info]   java.util.concurrent.TimeoutException: Futures timed out after [5 seconds]
25-Jul-2016 15:56:59 [info]   at scala.concurrent.impl.Promise$DefaultPromise.ready(Promise.scala:219)
25-Jul-2016 15:56:59 [info]   at scala.concurrent.impl.Promise$DefaultPromise.result(Promise.scala:223)
25-Jul-2016 15:56:59 [info]   at scala.concurrent.Await$$anonfun$result$1.apply(package.scala:107)
25-Jul-2016 15:56:59 [info]   at scala.concurrent.BlockContext$DefaultBlockContext$.blockOn(BlockContext.scala:53)
25-Jul-2016 15:56:59 [info]   at scala.concurrent.Await$.result(package.scala:107)
25-Jul-2016 15:56:59 [info]   at play.api.test.ResultExtractors$class.status(Helpers.scala:324)
25-Jul-2016 15:56:59 [info]   at play.api.test.Helpers$.status(Helpers.scala:364)
25-Jul-2016 15:56:59 [info]   at integration.CollectionsAPIAppSpec$$anonfun$2$$anonfun$apply$mcV$sp$17.apply$mcV$sp(CollectionsAPIAppSpec.scala:318)
25-Jul-2016 15:56:59 [info]   at integration.CollectionsAPIAppSpec$$anonfun$2$$anonfun$apply$mcV$sp$17.apply(CollectionsAPIAppSpec.scala:316)
25-Jul-2016 15:56:59 [info]   at integration.CollectionsAPIAppSpec$$anonfun$2$$anonfun$apply$mcV$sp$17.apply(CollectionsAPIAppSpec.scala:316)
25-Jul-2016 15:56:59 [info]   ...
25-Jul-2016 15:56:59 2016-07-25 15:56:59,183 - [DEBUG  ] - application - --- ElasticSearch Client is being created----
25-Jul-2016 15:56:59 2016-07-25 15:56:59,183 - [DEBUG  ] - application - Index "data"  is being created if it does not exist ---
25-Jul-2016 15:56:59 2016-07-25 15:56:59,183 - [ERROR  ] - application - Error connecting to elasticsearch: org.elasticsearch.client.transport.NoNodeAvailableException: None of the configured nodes are available: []
25-Jul-2016 15:56:59 2016-07-25 15:56:59,266 - [ERROR  ] - application - Could not call index because we are not connected.
25-Jul-2016 15:56:59 2016-07-25 15:56:59,267 - [DEBUG  ] - application - ----- Adding file to dataset completed
25-Jul-2016 15:56:59 2016-07-25 15:56:59,272 - [DEBUG  ] - application - tagStr=[]
25-Jul-2016 15:56:59 2016-07-25 15:56:59,274 - [DEBUG  ] - application - commentStr=[]
25-Jul-2016 15:56:59 2016-07-25 15:56:59,275 - [DEBUG  ] - application - usrmd={}
25-Jul-2016 15:56:59 2016-07-25 15:56:59,275 - [DEBUG  ] - application - techmd={}
25-Jul-2016 15:56:59 2016-07-25 15:56:59,280 - [DEBUG  ] - application - xmlmd={ }
25-Jul-2016 15:56:59 [play-akka.actor.default-dispatcher-9] INFO  elasticsearch.plugins  - [Kehl of Tauran] loaded [], sites []
25-Jul-2016 15:57:04 [info] - must respond to the removeCollection(coll_id:UUID) function routed by POST /api/collections/:coll_id/remove   *** FAILED ***
25-Jul-2016 15:57:04 [info]   java.util.concurrent.TimeoutException: Futures timed out after [5 seconds]
25-Jul-2016 15:57:04 [info]   at scala.concurrent.impl.Promise$DefaultPromise.ready(Promise.scala:219)
25-Jul-2016 15:57:04 [info]   at scala.concurrent.impl.Promise$DefaultPromise.result(Promise.scala:223)
25-Jul-2016 15:57:04 [info]   at scala.concurrent.Await$$anonfun$result$1.apply(package.scala:107)
25-Jul-2016 15:57:04 [info]   at scala.concurrent.BlockContext$DefaultBlockContext$.blockOn(BlockContext.scala:53)
25-Jul-2016 15:57:04 [info]   at scala.concurrent.Await$.result(package.scala:107)
25-Jul-2016 15:57:04 [info]   at play.api.test.ResultExtractors$class.status(Helpers.scala:324)
25-Jul-2016 15:57:04 [info]   at play.api.test.Helpers$.status(Helpers.scala:364)
25-Jul-2016 15:57:04 [info]   at integration.CollectionsAPIAppSpec$$anonfun$2$$anonfun$apply$mcV$sp$18.apply$mcV$sp(CollectionsAPIAppSpec.scala:329)
25-Jul-2016 15:57:04 [info]   at integration.CollectionsAPIAppSpec$$anonfun$2$$anonfun$apply$mcV$sp$18.apply(CollectionsAPIAppSpec.scala:326)
25-Jul-2016 15:57:04 [info]   at integration.CollectionsAPIAppSpec$$anonfun$2$$anonfun$apply$mcV$sp$18.apply(CollectionsAPIAppSpec.scala:326)
25-Jul-2016 15:57:04 [info]   ...
25-Jul-2016 15:57:09 [info] - must respond to the removeCollection(coll_id:UUID) function routed by DELETE /api/collections/:id   *** FAILED ***
25-Jul-2016 15:57:09 [info]   java.util.concurrent.TimeoutException: Futures timed out after [5 seconds]
25-Jul-2016 15:57:09 [info]   at scala.concurrent.impl.Promise$DefaultPromise.ready(Promise.scala:219)
25-Jul-2016 15:57:09 [info]   at scala.concurrent.impl.Promise$DefaultPromise.result(Promise.scala:223)
25-Jul-2016 15:57:09 [info]   at scala.concurrent.Await$$anonfun$result$1.apply(package.scala:107)
25-Jul-2016 15:57:09 [info]   at scala.concurrent.BlockContext$DefaultBlockContext$.blockOn(BlockContext.scala:53)
25-Jul-2016 15:57:09 [info]   at scala.concurrent.Await$.result(package.scala:107)
25-Jul-2016 15:57:09 [info]   at play.api.test.ResultExtractors$class.status(Helpers.scala:324)
25-Jul-2016 15:57:09 [info]   at play.api.test.Helpers$.status(Helpers.scala:364)
25-Jul-2016 15:57:09 [info]   at integration.CollectionsAPIAppSpec$$anonfun$2$$anonfun$apply$mcV$sp$19.apply$mcV$sp(CollectionsAPIAppSpec.scala:342)
25-Jul-2016 15:57:09 [info]   at integration.CollectionsAPIAppSpec$$anonfun$2$$anonfun$apply$mcV$sp$19.apply(CollectionsAPIAppSpec.scala:339)
25-Jul-2016 15:57:09 [info]   at integration.CollectionsAPIAppSpec$$anonfun$2$$anonfun$apply$mcV$sp$19.apply(CollectionsAPIAppSpec.scala:339)
25-Jul-2016 15:57:09 [info]   ...
25-Jul-2016 15:57:09 2016-07-25 15:57:09,250 - [DEBUG  ] - application - File1 is File:True
25-Jul-2016 15:57:09 [info] PreviewsAPIAppSpec:
25-Jul-2016 15:57:09 [info] The Previews API Spec
25-Jul-2016 15:57:09 [info] - must provide a FakeApplication
25-Jul-2016 15:57:09 [info] - must make the FakeApplication available implicitly
25-Jul-2016 15:57:09 [info] - must start the FakeApplication
25-Jul-2016 15:57:09 [info] The Previews API Spec
25-Jul-2016 15:57:13 2016-07-25 15:57:13,999 - [ERROR  ] - application - Could not call index because we are not connected.
25-Jul-2016 15:57:14 2016-07-25 15:57:14,156 - [DEBUG  ] - application - Getting value for tos.date
25-Jul-2016 15:57:14 2016-07-25 15:57:14,243 - [DEBUG  ] - application - Getting value for tos.date
25-Jul-2016 15:57:14 2016-07-25 15:57:14,277 - [DEBUG  ] - application - Getting value for tos.date
25-Jul-2016 15:57:14 2016-07-25 15:57:14,290 - [DEBUG  ] - application - Getting value for tos.date
25-Jul-2016 15:57:14 2016-07-25 15:57:14,296 - [DEBUG  ] - application - Getting value for tos.date
25-Jul-2016 15:57:14 2016-07-25 15:57:14,312 - [INFO   ] - application - created file 57967d2a60b2dad13fd4fbde
25-Jul-2016 15:57:14 2016-07-25 15:57:14,318 - [DEBUG  ] - application - Getting value for tos.date
25-Jul-2016 15:57:14 2016-07-25 15:57:14,318 - [DEBUG  ] - application - Uploading file dataset-image-1.zip
25-Jul-2016 15:57:14 [info] - must respond to the Upload File *** FAILED ***
25-Jul-2016 15:57:14 [info]   java.util.concurrent.TimeoutException: Futures timed out after [5 seconds]
25-Jul-2016 15:57:14 [info]   at scala.concurrent.impl.Promise$DefaultPromise.ready(Promise.scala:219)
25-Jul-2016 15:57:14 [info]   at scala.concurrent.impl.Promise$DefaultPromise.result(Promise.scala:223)
25-Jul-2016 15:57:14 [info]   at scala.concurrent.Await$$anonfun$result$1.apply(package.scala:107)
25-Jul-2016 15:57:14 [info]   at scala.concurrent.BlockContext$DefaultBlockContext$.blockOn(BlockContext.scala:53)
25-Jul-2016 15:57:14 [info]   at scala.concurrent.Await$.result(package.scala:107)
25-Jul-2016 15:57:14 [info]   at play.api.test.ResultExtractors$class.status(Helpers.scala:324)
25-Jul-2016 15:57:14 [info]   at play.api.test.Helpers$.status(Helpers.scala:364)
25-Jul-2016 15:57:14 [info]   at integration.PreviewsAPIAppSpec$$anonfun$2$$anonfun$apply$mcV$sp$4.apply$mcV$sp(PreviewsAPIAppSpec.scala:77)
25-Jul-2016 15:57:14 [info]   at integration.PreviewsAPIAppSpec$$anonfun$2$$anonfun$apply$mcV$sp$4.apply(PreviewsAPIAppSpec.scala:67)
25-Jul-2016 15:57:14 [info]   at integration.PreviewsAPIAppSpec$$anonfun$2$$anonfun$apply$mcV$sp$4.apply(PreviewsAPIAppSpec.scala:67)
25-Jul-2016 15:57:14 [info]   ...
25-Jul-2016 15:57:14 [info]   + Working Directory: /home/bamboo/bamboo-agent-home/xml-data/build-dir/CATS-CORE606-JOB1
25-Jul-2016 15:57:14 2016-07-25 15:57:14,350 - [DEBUG  ] - application - File1 is File:True
25-Jul-2016 15:57:14 [play-akka.actor.default-dispatcher-8] INFO  elasticsearch.plugins  - [Sunpyre] loaded [], sites []
25-Jul-2016 15:57:14 2016-07-25 15:57:14,530 - [INFO   ] - application - Uploading Completed
25-Jul-2016 15:57:14 2016-07-25 15:57:14,531 - [DEBUG  ] - application - Sending message ExtractorMessage(57967d2a60b2dad13fd4fbde,57967d2a60b2dad13fd4fbde,https://,clowder.file.multi.files-zipped,Map(filename -> dataset-image-1.zip),3797692,null,,phuong-test)
25-Jul-2016 15:57:19 [info] - must respond to the upload() and download() function routed by POST/GET /api/previews *** FAILED ***
25-Jul-2016 15:57:19 [info]   java.util.concurrent.TimeoutException: Futures timed out after [5 seconds]
25-Jul-2016 15:57:19 [info]   at scala.concurrent.impl.Promise$DefaultPromise.ready(Promise.scala:219)
25-Jul-2016 15:57:19 [info]   at scala.concurrent.impl.Promise$DefaultPromise.result(Promise.scala:223)
25-Jul-2016 15:57:19 [info]   at scala.concurrent.Await$$anonfun$result$1.apply(package.scala:107)
25-Jul-2016 15:57:19 [info]   at scala.concurrent.BlockContext$DefaultBlockContext$.blockOn(BlockContext.scala:53)
25-Jul-2016 15:57:19 [info]   at scala.concurrent.Await$.result(package.scala:107)
25-Jul-2016 15:57:19 [info]   at play.api.test.ResultExtractors$class.status(Helpers.scala:324)
25-Jul-2016 15:57:19 [info]   at play.api.test.Helpers$.status(Helpers.scala:364)
25-Jul-2016 15:57:19 [info]   at integration.PreviewsAPIAppSpec$$anonfun$2$$anonfun$apply$mcV$sp$5.apply$mcV$sp(PreviewsAPIAppSpec.scala:96)
25-Jul-2016 15:57:19 [info]   at integration.PreviewsAPIAppSpec$$anonfun$2$$anonfun$apply$mcV$sp$5.apply(PreviewsAPIAppSpec.scala:86)
25-Jul-2016 15:57:19 [info]   at integration.PreviewsAPIAppSpec$$anonfun$2$$anonfun$apply$mcV$sp$5.apply(PreviewsAPIAppSpec.scala:86)
25-Jul-2016 15:57:19 [info]   ...
25-Jul-2016 15:57:19 [info]   + Working Directory: /home/bamboo/bamboo-agent-home/xml-data/build-dir/CATS-CORE606-JOB1
25-Jul-2016 15:57:19 2016-07-25 15:57:19,469 - [DEBUG  ] - application - File2 is File:True
25-Jul-2016 15:57:19 [info] - must respond to the uploadMetadata(id: UUID) and getMetadata(id: UUID) function routed by POST/GET /api/previews/:id/metadata *** FAILED ***
25-Jul-2016 15:57:19 [info]   scala.MatchError: None (of class scala.None$)
25-Jul-2016 15:57:19 [info]   at integration.PreviewsAPIAppSpec$$anonfun$2$$anonfun$apply$mcV$sp$6.apply$mcV$sp(PreviewsAPIAppSpec.scala:142)
25-Jul-2016 15:57:19 [info]   at integration.PreviewsAPIAppSpec$$anonfun$2$$anonfun$apply$mcV$sp$6.apply(PreviewsAPIAppSpec.scala:125)
25-Jul-2016 15:57:19 [info]   at integration.PreviewsAPIAppSpec$$anonfun$2$$anonfun$apply$mcV$sp$6.apply(PreviewsAPIAppSpec.scala:125)
25-Jul-2016 15:57:19 [info]   at org.scalatest.Transformer$$anonfun$apply$1.apply(Transformer.scala:22)
25-Jul-2016 15:57:19 [info]   at org.scalatest.Transformer$$anonfun$apply$1.apply(Transformer.scala:22)
25-Jul-2016 15:57:19 [info]   at org.scalatest.OutcomeOf$class.outcomeOf(OutcomeOf.scala:85)
25-Jul-2016 15:57:19 [info]   at org.scalatest.OutcomeOf$.outcomeOf(OutcomeOf.scala:104)
25-Jul-2016 15:57:19 [info]   at org.scalatest.Transformer.apply(Transformer.scala:22)
25-Jul-2016 15:57:19 [info]   at org.scalatest.Transformer.apply(Transformer.scala:20)
25-Jul-2016 15:57:19 [info]   at org.scalatest.WordSpecLike$$anon$1.apply(WordSpecLike.scala:945)
25-Jul-2016 15:57:19 [info]   ...
25-Jul-2016 15:57:19 [info]   + File Pathing /home/bamboo/bamboo-agent-home/xml-data/build-dir/CATS-CORE606-JOB1/test/data/previews/data-test-general.json
25-Jul-2016 15:57:19 [info]   + Pretty JSON format
25-Jul-2016 15:57:19 [info]   + {
25-Jul-2016 15:57:19 [info]   "Image" : "fid",
25-Jul-2016 15:57:19 [info]   "extractor_id" : "test-extractor"
25-Jul-2016 15:57:19 [info] }
25-Jul-2016 15:57:19 [info] - must respond to the attachPreview(file_id:UUID, preview:UUID) function routed by POST /api/files/:file_id/previews/:p_id   *** FAILED ***
25-Jul-2016 15:57:19 [info]   scala.MatchError: None (of class scala.None$)
25-Jul-2016 15:57:19 [info]   at integration.PreviewsAPIAppSpec$$anonfun$2$$anonfun$apply$mcV$sp$7.apply$mcV$sp(PreviewsAPIAppSpec.scala:151)
25-Jul-2016 15:57:19 [info]   at integration.PreviewsAPIAppSpec$$anonfun$2$$anonfun$apply$mcV$sp$7.apply(PreviewsAPIAppSpec.scala:150)
25-Jul-2016 15:57:19 [info]   at integration.PreviewsAPIAppSpec$$anonfun$2$$anonfun$apply$mcV$sp$7.apply(PreviewsAPIAppSpec.scala:150)
25-Jul-2016 15:57:19 [info]   at org.scalatest.Transformer$$anonfun$apply$1.apply(Transformer.scala:22)
25-Jul-2016 15:57:19 [info]   at org.scalatest.Transformer$$anonfun$apply$1.apply(Transformer.scala:22)
25-Jul-2016 15:57:19 [info]   at org.scalatest.OutcomeOf$class.outcomeOf(OutcomeOf.scala:85)
25-Jul-2016 15:57:19 [info]   at org.scalatest.OutcomeOf$.outcomeOf(OutcomeOf.scala:104)
25-Jul-2016 15:57:19 [info]   at org.scalatest.Transformer.apply(Transformer.scala:22)
25-Jul-2016 15:57:19 [info]   at org.scalatest.Transformer.apply(Transformer.scala:20)
25-Jul-2016 15:57:19 [info]   at org.scalatest.WordSpecLike$$anon$1.apply(WordSpecLike.scala:945)
25-Jul-2016 15:57:19 [info]   ...
25-Jul-2016 15:57:19 [info] - must respond to the filePreviewsList(id: UUID) function routed by GET /api/files/:file_id/listpreviews *** FAILED ***
25-Jul-2016 15:57:19 [info]   scala.MatchError: None (of class scala.None$)
25-Jul-2016 15:57:19 [info]   at integration.PreviewsAPIAppSpec$$anonfun$2$$anonfun$apply$mcV$sp$8.apply$mcV$sp(PreviewsAPIAppSpec.scala:164)
25-Jul-2016 15:57:19 [info]   at integration.PreviewsAPIAppSpec$$anonfun$2$$anonfun$apply$mcV$sp$8.apply(PreviewsAPIAppSpec.scala:163)
25-Jul-2016 15:57:19 [info]   at integration.PreviewsAPIAppSpec$$anonfun$2$$anonfun$apply$mcV$sp$8.apply(PreviewsAPIAppSpec.scala:163)
25-Jul-2016 15:57:19 [info]   at org.scalatest.Transformer$$anonfun$apply$1.apply(Transformer.scala:22)
25-Jul-2016 15:57:19 [info]   at org.scalatest.Transformer$$anonfun$apply$1.apply(Transformer.scala:22)
25-Jul-2016 15:57:19 [info]   at org.scalatest.OutcomeOf$class.outcomeOf(OutcomeOf.scala:85)
25-Jul-2016 15:57:19 [info]   at org.scalatest.OutcomeOf$.outcomeOf(OutcomeOf.scala:104)
25-Jul-2016 15:57:19 [info]   at org.scalatest.Transformer.apply(Transformer.scala:22)
25-Jul-2016 15:57:19 [info]   at org.scalatest.Transformer.apply(Transformer.scala:20)
25-Jul-2016 15:57:19 [info]   at org.scalatest.WordSpecLike$$anon$1.apply(WordSpecLike.scala:945)
25-Jul-2016 15:57:19 [info]   ...
25-Jul-2016 15:57:19 [info] - must respond to the getPreviews(id: UUID) function routed by GET /api/files/:file_id/getPreviews *** FAILED ***
25-Jul-2016 15:57:19 [info]   scala.MatchError: None (of class scala.None$)
25-Jul-2016 15:57:19 [info]   at integration.PreviewsAPIAppSpec$$anonfun$2$$anonfun$apply$mcV$sp$9.apply$mcV$sp(PreviewsAPIAppSpec.scala:177)
25-Jul-2016 15:57:19 [info]   at integration.PreviewsAPIAppSpec$$anonfun$2$$anonfun$apply$mcV$sp$9.apply(PreviewsAPIAppSpec.scala:176)
25-Jul-2016 15:57:19 [info]   at integration.PreviewsAPIAppSpec$$anonfun$2$$anonfun$apply$mcV$sp$9.apply(PreviewsAPIAppSpec.scala:176)
25-Jul-2016 15:57:19 [info]   at org.scalatest.Transformer$$anonfun$apply$1.apply(Transformer.scala:22)
25-Jul-2016 15:57:19 [info]   at org.scalatest.Transformer$$anonfun$apply$1.apply(Transformer.scala:22)
25-Jul-2016 15:57:19 [info]   at org.scalatest.OutcomeOf$class.outcomeOf(OutcomeOf.scala:85)
25-Jul-2016 15:57:19 [info]   at org.scalatest.OutcomeOf$.outcomeOf(OutcomeOf.scala:104)
25-Jul-2016 15:57:19 [info]   at org.scalatest.Transformer.apply(Transformer.scala:22)
25-Jul-2016 15:57:19 [info]   at org.scalatest.Transformer.apply(Transformer.scala:20)
25-Jul-2016 15:57:19 [info]   at org.scalatest.WordSpecLike$$anon$1.apply(WordSpecLike.scala:945)
25-Jul-2016 15:57:19 [info]   ...
25-Jul-2016 15:57:23 2016-07-25 15:57:23,648 - [ERROR  ] - application - Could not call index because we are not connected.
25-Jul-2016 15:57:23 2016-07-25 15:57:23,648 - [DEBUG  ] - application - ----- Adding file to dataset completed
25-Jul-2016 15:57:23 2016-07-25 15:57:23,651 - [DEBUG  ] - application - tagStr=[]
25-Jul-2016 15:57:23 2016-07-25 15:57:23,653 - [DEBUG  ] - application - commentStr=[]
25-Jul-2016 15:57:23 2016-07-25 15:57:23,654 - [DEBUG  ] - application - usrmd={}
25-Jul-2016 15:57:23 2016-07-25 15:57:23,654 - [DEBUG  ] - application - techmd={}
25-Jul-2016 15:57:23 2016-07-25 15:57:23,655 - [DEBUG  ] - application - xmlmd={ }
25-Jul-2016 15:57:23 [play-akka.actor.default-dispatcher-2] INFO  elasticsearch.plugins  - [Krista Marwan] loaded [], sites []
25-Jul-2016 15:57:24 [info] - must respond to the list() function routed by GET /api/previews *** FAILED ***
25-Jul-2016 15:57:24 [info]   java.util.concurrent.TimeoutException: Futures timed out after [5 seconds]
25-Jul-2016 15:57:24 [info]   at scala.concurrent.impl.Promise$DefaultPromise.ready(Promise.scala:219)
25-Jul-2016 15:57:24 [info]   at scala.concurrent.impl.Promise$DefaultPromise.result(Promise.scala:223)
25-Jul-2016 15:57:24 [info]   at scala.concurrent.Await$$anonfun$result$1.apply(package.scala:107)
25-Jul-2016 15:57:24 [info]   at scala.concurrent.BlockContext$DefaultBlockContext$.blockOn(BlockContext.scala:53)
25-Jul-2016 15:57:24 [info]   at scala.concurrent.Await$.result(package.scala:107)
25-Jul-2016 15:57:24 [info]   at play.api.test.ResultExtractors$class.status(Helpers.scala:324)
25-Jul-2016 15:57:24 [info]   at play.api.test.Helpers$.status(Helpers.scala:364)
25-Jul-2016 15:57:24 [info]   at integration.PreviewsAPIAppSpec$$anonfun$2$$anonfun$apply$mcV$sp$10.apply$mcV$sp(PreviewsAPIAppSpec.scala:192)
25-Jul-2016 15:57:24 [info]   at integration.PreviewsAPIAppSpec$$anonfun$2$$anonfun$apply$mcV$sp$10.apply(PreviewsAPIAppSpec.scala:189)
25-Jul-2016 15:57:24 [info]   at integration.PreviewsAPIAppSpec$$anonfun$2$$anonfun$apply$mcV$sp$10.apply(PreviewsAPIAppSpec.scala:189)
25-Jul-2016 15:57:24 [info]   ...
25-Jul-2016 15:57:24 [info] - must respond to the removePreview(id:UUID) function routed by DELETE /api/previews/:id for morrowplots preview file  *** FAILED ***
25-Jul-2016 15:57:24 [info]   scala.MatchError: None (of class scala.None$)
25-Jul-2016 15:57:24 [info]   at integration.PreviewsAPIAppSpec$$anonfun$2$$anonfun$apply$mcV$sp$11.apply$mcV$sp(PreviewsAPIAppSpec.scala:202)
25-Jul-2016 15:57:24 [info]   at integration.PreviewsAPIAppSpec$$anonfun$2$$anonfun$apply$mcV$sp$11.apply(PreviewsAPIAppSpec.scala:201)
25-Jul-2016 15:57:24 [info]   at integration.PreviewsAPIAppSpec$$anonfun$2$$anonfun$apply$mcV$sp$11.apply(PreviewsAPIAppSpec.scala:201)
25-Jul-2016 15:57:24 [info]   at org.scalatest.Transformer$$anonfun$apply$1.apply(Transformer.scala:22)
25-Jul-2016 15:57:24 [info]   at org.scalatest.Transformer$$anonfun$apply$1.apply(Transformer.scala:22)
25-Jul-2016 15:57:24 [info]   at org.scalatest.OutcomeOf$class.outcomeOf(OutcomeOf.scala:85)
25-Jul-2016 15:57:24 [info]   at org.scalatest.OutcomeOf$.outcomeOf(OutcomeOf.scala:104)
25-Jul-2016 15:57:24 [info]   at org.scalatest.Transformer.apply(Transformer.scala:22)
25-Jul-2016 15:57:24 [info]   at org.scalatest.Transformer.apply(Transformer.scala:20)
25-Jul-2016 15:57:24 [info]   at org.scalatest.WordSpecLike$$anon$1.apply(WordSpecLike.scala:945)
25-Jul-2016 15:57:24 [info]   ...
25-Jul-2016 15:57:24 [info] - must respond to the removeFile(id:UUID) function routed by DELETE /api/files/:id   *** FAILED ***
25-Jul-2016 15:57:24 [info]   scala.MatchError: None (of class scala.None$)
25-Jul-2016 15:57:24 [info]   at integration.PreviewsAPIAppSpec$$anonfun$2$$anonfun$apply$mcV$sp$12.apply$mcV$sp(PreviewsAPIAppSpec.scala:214)
25-Jul-2016 15:57:24 [info]   at integration.PreviewsAPIAppSpec$$anonfun$2$$anonfun$apply$mcV$sp$12.apply(PreviewsAPIAppSpec.scala:213)
25-Jul-2016 15:57:24 [info]   at integration.PreviewsAPIAppSpec$$anonfun$2$$anonfun$apply$mcV$sp$12.apply(PreviewsAPIAppSpec.scala:213)
25-Jul-2016 15:57:24 [info]   at org.scalatest.Transformer$$anonfun$apply$1.apply(Transformer.scala:22)
25-Jul-2016 15:57:24 [info]   at org.scalatest.Transformer$$anonfun$apply$1.apply(Transformer.scala:22)
25-Jul-2016 15:57:24 [info]   at org.scalatest.OutcomeOf$class.outcomeOf(OutcomeOf.scala:85)
25-Jul-2016 15:57:24 [info]   at org.scalatest.OutcomeOf$.outcomeOf(OutcomeOf.scala:104)
25-Jul-2016 15:57:24 [info]   at org.scalatest.Transformer.apply(Transformer.scala:22)
25-Jul-2016 15:57:24 [info]   at org.scalatest.Transformer.apply(Transformer.scala:20)
25-Jul-2016 15:57:24 [info]   at org.scalatest.WordSpecLike$$anon$1.apply(WordSpecLike.scala:945)
25-Jul-2016 15:57:24 [info]   ...
25-Jul-2016 15:57:24 [info] ApplicationSpec:
25-Jul-2016 15:57:24 [info] The Application API Spec
25-Jul-2016 15:57:24 [info] - must provide a FakeApplication
25-Jul-2016 15:57:24 [info] - must make the FakeApplication available implicitly
25-Jul-2016 15:57:24 [info] - must start the FakeApplication
25-Jul-2016 15:57:24 [info] - must send 404 on a bad request
25-Jul-2016 15:57:29 2016-07-25 15:57:29,434 - [DEBUG  ] - application - --- ElasticSearch Client is being created----
25-Jul-2016 15:57:29 2016-07-25 15:57:29,434 - [DEBUG  ] - application - Index "data"  is being created if it does not exist ---
25-Jul-2016 15:57:29 2016-07-25 15:57:29,435 - [ERROR  ] - application - Error connecting to elasticsearch: org.elasticsearch.client.transport.NoNodeAvailableException: None of the configured nodes are available: []
25-Jul-2016 15:57:29 [info] - must render the index page *** FAILED ***
25-Jul-2016 15:57:29 [info]   java.util.concurrent.TimeoutException: Futures timed out after [5 seconds]
25-Jul-2016 15:57:29 [info]   at scala.concurrent.impl.Promise$DefaultPromise.ready(Promise.scala:219)
25-Jul-2016 15:57:29 [info]   at scala.concurrent.impl.Promise$DefaultPromise.result(Promise.scala:223)
25-Jul-2016 15:57:29 [info]   at scala.concurrent.Await$$anonfun$result$1.apply(package.scala:107)
25-Jul-2016 15:57:29 [info]   at scala.concurrent.BlockContext$DefaultBlockContext$.blockOn(BlockContext.scala:53)
25-Jul-2016 15:57:29 [info]   at scala.concurrent.Await$.result(package.scala:107)
25-Jul-2016 15:57:29 [info]   at play.api.test.ResultExtractors$class.status(Helpers.scala:324)
25-Jul-2016 15:57:29 [info]   at play.api.test.Helpers$.status(Helpers.scala:364)
25-Jul-2016 15:57:29 [info]   at integration.ApplicationSpec$$anonfun$1$$anonfun$apply$mcV$sp$5.apply$mcV$sp(ApplicationSpec.scala:40)
25-Jul-2016 15:57:29 [info]   at integration.ApplicationSpec$$anonfun$1$$anonfun$apply$mcV$sp$5.apply(ApplicationSpec.scala:37)
25-Jul-2016 15:57:29 [info]   at integration.ApplicationSpec$$anonfun$1$$anonfun$apply$mcV$sp$5.apply(ApplicationSpec.scala:37)
25-Jul-2016 15:57:29 [info]   ...
25-Jul-2016 15:57:29 2016-07-25 15:57:29,651 - [DEBUG  ] - application - Getting value for theme
25-Jul-2016 15:57:30 2016-07-25 15:57:30,523 - [DEBUG  ] - application - Getting value for display.name
25-Jul-2016 15:57:30 2016-07-25 15:57:30,539 - [DEBUG  ] - application - [securesocial] bootstrap path = securesocial/bootstrap/css/bootstrap.min.css
25-Jul-2016 15:57:30 2016-07-25 15:57:30,540 - [DEBUG  ] - application - [securesocial] assets controller = controllers.ReverseAssets
25-Jul-2016 15:57:30 2016-07-25 15:57:30,541 - [DEBUG  ] - application - [securesocial] favicon path = securesocial/images/favicon.png
25-Jul-2016 15:57:30 2016-07-25 15:57:30,543 - [DEBUG  ] - application - [securesocial] Jquery path = securesocial/javascripts/jquery-1.7.1.min.js
25-Jul-2016 15:57:30 2016-07-25 15:57:30,544 - [DEBUG  ] - application - [securesocial] custom css path = None
25-Jul-2016 15:57:30 2016-07-25 15:57:30,551 - [DEBUG  ] - application - Getting value for google.analytics
25-Jul-2016 15:57:30 [info] - must render index template
25-Jul-2016 15:57:30 2016-07-25 15:57:30,559 - [INFO   ] - application - Space Sharing Plugin has stopped
25-Jul-2016 15:57:44 2016-07-25 15:57:44,557 - [DEBUG  ] - application - --- ElasticSearch Client is being created----
25-Jul-2016 15:57:44 2016-07-25 15:57:44,559 - [DEBUG  ] - application - Index "data"  is being created if it does not exist ---
25-Jul-2016 15:57:44 2016-07-25 15:57:44,560 - [ERROR  ] - application - Error connecting to elasticsearch: org.elasticsearch.client.transport.NoNodeAvailableException: None of the configured nodes are available: []
25-Jul-2016 15:57:53 2016-07-25 15:57:53,767 - [DEBUG  ] - application - --- ElasticSearch Client is being created----
25-Jul-2016 15:57:53 2016-07-25 15:57:53,768 - [DEBUG  ] - application - Index "data"  is being created if it does not exist ---
25-Jul-2016 15:57:53 2016-07-25 15:57:53,769 - [ERROR  ] - application - Error connecting to elasticsearch: org.elasticsearch.client.transport.NoNodeAvailableException: None of the configured nodes are available: []
25-Jul-2016 15:57:59 2016-07-25 15:57:59,516 - [ERROR  ] - application - Could not call index because we are not connected.
25-Jul-2016 15:57:59 2016-07-25 15:57:59,519 - [INFO   ] - application - ElasticsearchPlugin has stopped
25-Jul-2016 15:57:59 2016-07-25 15:57:59,527 - [INFO   ] - application - [securesocial] unloaded event listener SecureSocialEventListener
25-Jul-2016 15:57:59 2016-07-25 15:57:59,528 - [INFO   ] - application - [securesocial] unloaded identity provider: userpass
25-Jul-2016 15:57:59 2016-07-25 15:57:59,529 - [INFO   ] - application - Application shutdown
25-Jul-2016 15:57:59 2016-07-25 15:57:59,530 - [INFO   ] - application - [securesocial] unloaded password hasher bcrypt
25-Jul-2016 15:57:59 2016-07-25 15:57:59,532 - [DEBUG  ] - application - Shutting down Rabbitmq Plugin
25-Jul-2016 15:57:59 2016-07-25 15:57:59,534 - [DEBUG  ] - application - Closing connection
25-Jul-2016 15:57:59 [play-akka.actor.default-dispatcher-9] INFO  elasticsearch.plugins  - [Sandman] loaded [], sites []
25-Jul-2016 15:57:59 2016-07-25 15:57:59,556 - [INFO   ] - play - Shutdown application default Akka system.
25-Jul-2016 15:57:59 2016-07-25 15:57:59,637 - [DEBUG  ] - application - SwaggerPlugin.onStop
25-Jul-2016 15:58:00 [info] ScalaTest
25-Jul-2016 15:58:00 [info] Run completed in 2 minutes, 12 seconds.
25-Jul-2016 15:58:00 [info] Total number of tests run: 83
25-Jul-2016 15:58:00 [info] Suites: completed 7, aborted 0
25-Jul-2016 15:58:00 [info] Tests: succeeded 38, failed 45, canceled 0, ignored 0, pending 0
25-Jul-2016 15:58:00 [info] *** 45 TESTS FAILED ***
25-Jul-2016 15:58:00 [error] Failed: Total 6, Failed 1, Errors 0, Passed 5
25-Jul-2016 15:58:00 [error] Failed tests:
25-Jul-2016 15:58:00 [error]         integration.APITestSuite
25-Jul-2016 15:58:00 [error] (test:testOnly) sbt.TestsFailedException: Tests unsuccessful
25-Jul-2016 15:58:00 [error] Total time: 163 s, completed Jul 25, 2016 3:58:00 PM
25-Jul-2016 15:58:00 Failing task since return code of [/home/bamboo/sbt-0.13.2/bin/sbt test-only integration.APITestSuite] was 1 while expected 0
25-Jul-2016 15:58:00 Finished task 'test' with result: Failed
25-Jul-2016 15:58:00 Starting task 'junit' of type 'com.atlassian.bamboo.plugins.testresultparser:task.testresultparser.junit'
25-Jul-2016 15:58:00 Parsing test results under /home/bamboo/bamboo-agent-home/xml-data/build-dir/CATS-CORE606-JOB1...
25-Jul-2016 15:58:00 Failing task since 45 failing test cases were found.
25-Jul-2016 15:58:00 Finished task 'junit' with result: Failed
25-Jul-2016 15:58:00 Running post build plugin 'Docker Container Cleanup'
25-Jul-2016 15:58:00 Running post build plugin 'NCover Results Collector'
25-Jul-2016 15:58:00 Running post build plugin 'Clover Results Collector'
25-Jul-2016 15:58:00 Running post build plugin 'npm Cache Cleanup'
25-Jul-2016 15:58:00 Running post build plugin 'Artifact Copier'
25-Jul-2016 15:58:00 Publishing an artifact: dist
25-Jul-2016 15:58:12 Finished publishing of artifact Shared artifact: [dist], pattern: [clowder-*.zip] anchored at: [target/universal] in 11.69 s
25-Jul-2016 15:58:12 Publishing an artifact: scaladoc
25-Jul-2016 15:58:15 Finished publishing of artifact Shared artifact: [scaladoc], pattern: [**/*] anchored at: [target/scala-2.10/api] in 2.803 s
25-Jul-2016 15:58:15 Publishing an artifact: manual
25-Jul-2016 15:58:15 Finished publishing of artifact Shared artifact: [manual], pattern: [**/*] anchored at: [doc/src/sphinx/_build/html] in 828.4 ms
25-Jul-2016 15:58:15 Finalising the build...
25-Jul-2016 15:58:15 Stopping timer.
25-Jul-2016 15:58:15 Build CATS-CORE606-JOB1-1 completed.
25-Jul-2016 15:58:16 Running on server: post build plugin 'NCover Results Collector'
25-Jul-2016 15:58:16 Running on server: post build plugin 'Build Hanging Detection Configuration'
25-Jul-2016 15:58:16 Running on server: post build plugin 'Clover Delta Calculator'
25-Jul-2016 15:58:16 Running on server: post build plugin 'Maven Dependencies Postprocessor'
25-Jul-2016 15:58:16 All post build plugins have finished
25-Jul-2016 15:58:16 Generating build results summary...
25-Jul-2016 15:58:16 Saving build results to disk...
25-Jul-2016 15:58:16 Logging substituted variables...
25-Jul-2016 15:58:16 Indexing build results...
25-Jul-2016 15:58:16 Finished building CATS-CORE606-JOB1-1.