Build: #3 failed

Job: default failed

Stages & jobs

  1. Default Stage

Job result summary

Completed
Duration
7 minutes
Revision
b811b7d166d629f9b732d6d7fd18ba334187f4ab b811b7d166d629f9b732d6d7fd18ba334187f4ab
Total tests
88
Failing since
#2 (Code changes detected – )
Number of retries
1

Tests

  • 88 tests in total
  • 38 tests failed
  • 5 seconds taken in total.
Existing test failures 38
Status Test Failing since Duration
class org.scalatest.exceptions.TestFailedException: "[]" did not include substring "datasetname"

      org.scalatest.exceptions.TestFailedException: "[]" did not include substring "datasetname"
      at org.scalatest.MatchersHelper$.newTestFailedException(MatchersHelper.scala:160)
      at org.scalatest.MustMatchers$MustMethodHelper$.mustMatcher(MustMatchers.scala:6141)
      at org.scalatest.MustMatchers$AnyMustWrapper.must(MustMatchers.scala:6175)
      at integration.CollectionsAPIAppSpec$$anonfun$2$$anonfun$apply$mcV$sp$8.apply$mcV$sp(CollectionsAPIAppSpec.scala:275)
      at integration.CollectionsAPIAppSpec$$anonfun$2$$anonfun$apply$mcV$sp$8.apply(CollectionsAPIAppSpec.scala:268)
(47 more lines...)
class org.scalatest.exceptions.TestFailedException: "[]" did not include substring "datasetname"

      org.scalatest.exceptions.TestFailedException: "[]" did not include substring "datasetname"
      at org.scalatest.MatchersHelper$.newTestFailedException(MatchersHelper.scala:160)
      at org.scalatest.MustMatchers$MustMethodHelper$.mustMatcher(MustMatchers.scala:6141)
      at org.scalatest.MustMatchers$AnyMustWrapper.must(MustMatchers.scala:6175)
      at integration.CollectionsAPIAppSpec$$anonfun$2$$anonfun$apply$mcV$sp$11.apply$mcV$sp(CollectionsAPIAppSpec.scala:414)
      at integration.CollectionsAPIAppSpec$$anonfun$2$$anonfun$apply$mcV$sp$11.apply(CollectionsAPIAppSpec.scala:406)
(47 more lines...)
class org.scalatest.exceptions.TestFailedException: 401 did not equal 200

      org.scalatest.exceptions.TestFailedException: 401 did not equal 200
      at org.scalatest.MatchersHelper$.newTestFailedException(MatchersHelper.scala:160)
      at org.scalatest.MustMatchers$AnyMustWrapper.mustEqual(MustMatchers.scala:6213)
      at integration.CollectionsAPIAppSpec$$anonfun$2$$anonfun$apply$mcV$sp$6.apply$mcV$sp(CollectionsAPIAppSpec.scala:178)
      at integration.CollectionsAPIAppSpec$$anonfun$2$$anonfun$apply$mcV$sp$6.apply(CollectionsAPIAppSpec.scala:161)
      at integration.CollectionsAPIAppSpec$$anonfun$2$$anonfun$apply$mcV$sp$6.apply(CollectionsAPIAppSpec.scala:161)
(46 more lines...)
class org.scalatest.exceptions.TestFailedException: 401 did not equal 200

      org.scalatest.exceptions.TestFailedException: 401 did not equal 200
      at org.scalatest.MatchersHelper$.newTestFailedException(MatchersHelper.scala:160)
      at org.scalatest.MustMatchers$AnyMustWrapper.mustEqual(MustMatchers.scala:6213)
      at integration.CollectionsAPIAppSpec$$anonfun$2$$anonfun$apply$mcV$sp$7.apply$mcV$sp(CollectionsAPIAppSpec.scala:231)
      at integration.CollectionsAPIAppSpec$$anonfun$2$$anonfun$apply$mcV$sp$7.apply(CollectionsAPIAppSpec.scala:214)
      at integration.CollectionsAPIAppSpec$$anonfun$2$$anonfun$apply$mcV$sp$7.apply(CollectionsAPIAppSpec.scala:214)
(46 more lines...)
class org.scalatest.exceptions.TestFailedException: "[]" did not include substring "datasetname"

      org.scalatest.exceptions.TestFailedException: "[]" did not include substring "datasetname"
      at org.scalatest.MatchersHelper$.newTestFailedException(MatchersHelper.scala:160)
      at org.scalatest.MustMatchers$MustMethodHelper$.mustMatcher(MustMatchers.scala:6141)
      at org.scalatest.MustMatchers$AnyMustWrapper.must(MustMatchers.scala:6175)
      at integration.CollectionsAPIAppSpec$$anonfun$2$$anonfun$apply$mcV$sp$14.apply$mcV$sp(CollectionsAPIAppSpec.scala:595)
      at integration.CollectionsAPIAppSpec$$anonfun$2$$anonfun$apply$mcV$sp$14.apply(CollectionsAPIAppSpec.scala:586)
(47 more lines...)
class org.scalatest.exceptions.TestFailedException: "[]" did not include substring "datasetname"

      org.scalatest.exceptions.TestFailedException: "[]" did not include substring "datasetname"
      at org.scalatest.MatchersHelper$.newTestFailedException(MatchersHelper.scala:160)
      at org.scalatest.MustMatchers$MustMethodHelper$.mustMatcher(MustMatchers.scala:6141)
      at org.scalatest.MustMatchers$AnyMustWrapper.must(MustMatchers.scala:6175)
      at integration.CollectionsAPIAppSpec$$anonfun$2$$anonfun$apply$mcV$sp$15.apply$mcV$sp(CollectionsAPIAppSpec.scala:636)
      at integration.CollectionsAPIAppSpec$$anonfun$2$$anonfun$apply$mcV$sp$15.apply(CollectionsAPIAppSpec.scala:627)
(47 more lines...)
class org.scalatest.exceptions.TestFailedException: "[]" did not include substring "datasetname"

      org.scalatest.exceptions.TestFailedException: "[]" did not include substring "datasetname"
      at org.scalatest.MatchersHelper$.newTestFailedException(MatchersHelper.scala:160)
      at org.scalatest.MustMatchers$MustMethodHelper$.mustMatcher(MustMatchers.scala:6141)
      at org.scalatest.MustMatchers$AnyMustWrapper.must(MustMatchers.scala:6175)
      at integration.CollectionsAPIAppSpec$$anonfun$2$$anonfun$apply$mcV$sp$12.apply$mcV$sp(CollectionsAPIAppSpec.scala:475)
      at integration.CollectionsAPIAppSpec$$anonfun$2$$anonfun$apply$mcV$sp$12.apply(CollectionsAPIAppSpec.scala:468)
(47 more lines...)
class org.scalatest.exceptions.TestFailedException: "[]" did not include substring "datasetname"

      org.scalatest.exceptions.TestFailedException: "[]" did not include substring "datasetname"
      at org.scalatest.MatchersHelper$.newTestFailedException(MatchersHelper.scala:160)
      at org.scalatest.MustMatchers$MustMethodHelper$.mustMatcher(MustMatchers.scala:6141)
      at org.scalatest.MustMatchers$AnyMustWrapper.must(MustMatchers.scala:6175)
      at integration.CollectionsAPIAppSpec$$anonfun$2$$anonfun$apply$mcV$sp$13.apply$mcV$sp(CollectionsAPIAppSpec.scala:533)
      at integration.CollectionsAPIAppSpec$$anonfun$2$$anonfun$apply$mcV$sp$13.apply(CollectionsAPIAppSpec.scala:526)
(47 more lines...)
class org.scalatest.exceptions.TestFailedException: "[]" did not include substring "datasetname"

      org.scalatest.exceptions.TestFailedException: "[]" did not include substring "datasetname"
      at org.scalatest.MatchersHelper$.newTestFailedException(MatchersHelper.scala:160)
      at org.scalatest.MustMatchers$MustMethodHelper$.mustMatcher(MustMatchers.scala:6141)
      at org.scalatest.MustMatchers$AnyMustWrapper.must(MustMatchers.scala:6175)
      at integration.DatasetsAPIAppSpec$$anonfun$2$$anonfun$apply$mcV$sp$15.apply$mcV$sp(DatasetsAPIAppSpec.scala:715)
      at integration.DatasetsAPIAppSpec$$anonfun$2$$anonfun$apply$mcV$sp$15.apply(DatasetsAPIAppSpec.scala:708)
(47 more lines...)
class org.scalatest.exceptions.TestFailedException: "[]" did not include substring "datasetname"

      org.scalatest.exceptions.TestFailedException: "[]" did not include substring "datasetname"
      at org.scalatest.MatchersHelper$.newTestFailedException(MatchersHelper.scala:160)
      at org.scalatest.MustMatchers$MustMethodHelper$.mustMatcher(MustMatchers.scala:6141)
      at org.scalatest.MustMatchers$AnyMustWrapper.must(MustMatchers.scala:6175)
      at integration.DatasetsAPIAppSpec$$anonfun$2$$anonfun$apply$mcV$sp$10.apply$mcV$sp(DatasetsAPIAppSpec.scala:343)
      at integration.DatasetsAPIAppSpec$$anonfun$2$$anonfun$apply$mcV$sp$10.apply(DatasetsAPIAppSpec.scala:336)
(47 more lines...)
class org.scalatest.exceptions.TestFailedException: "[]" did not include substring "datasetname"

      org.scalatest.exceptions.TestFailedException: "[]" did not include substring "datasetname"
      at org.scalatest.MatchersHelper$.newTestFailedException(MatchersHelper.scala:160)
      at org.scalatest.MustMatchers$MustMethodHelper$.mustMatcher(MustMatchers.scala:6141)
      at org.scalatest.MustMatchers$AnyMustWrapper.must(MustMatchers.scala:6175)
      at integration.DatasetsAPIAppSpec$$anonfun$2$$anonfun$apply$mcV$sp$13.apply$mcV$sp(DatasetsAPIAppSpec.scala:501)
      at integration.DatasetsAPIAppSpec$$anonfun$2$$anonfun$apply$mcV$sp$13.apply(DatasetsAPIAppSpec.scala:494)
(47 more lines...)
class org.scalatest.exceptions.TestFailedException: "[]" did not include substring "datasetname"

      org.scalatest.exceptions.TestFailedException: "[]" did not include substring "datasetname"
      at org.scalatest.MatchersHelper$.newTestFailedException(MatchersHelper.scala:160)
      at org.scalatest.MustMatchers$MustMethodHelper$.mustMatcher(MustMatchers.scala:6141)
      at org.scalatest.MustMatchers$AnyMustWrapper.must(MustMatchers.scala:6175)
      at integration.DatasetsAPIAppSpec$$anonfun$2$$anonfun$apply$mcV$sp$16.apply$mcV$sp(DatasetsAPIAppSpec.scala:769)
      at integration.DatasetsAPIAppSpec$$anonfun$2$$anonfun$apply$mcV$sp$16.apply(DatasetsAPIAppSpec.scala:762)
(47 more lines...)
class org.scalatest.exceptions.TestFailedException: "[]" did not include substring "datasetname"

      org.scalatest.exceptions.TestFailedException: "[]" did not include substring "datasetname"
      at org.scalatest.MatchersHelper$.newTestFailedException(MatchersHelper.scala:160)
      at org.scalatest.MustMatchers$MustMethodHelper$.mustMatcher(MustMatchers.scala:6141)
      at org.scalatest.MustMatchers$AnyMustWrapper.must(MustMatchers.scala:6175)
      at integration.DatasetsAPIAppSpec$$anonfun$2$$anonfun$apply$mcV$sp$9.apply$mcV$sp(DatasetsAPIAppSpec.scala:302)
      at integration.DatasetsAPIAppSpec$$anonfun$2$$anonfun$apply$mcV$sp$9.apply(DatasetsAPIAppSpec.scala:295)
(47 more lines...)
class org.scalatest.exceptions.TestFailedException: 401 did not equal 200

      org.scalatest.exceptions.TestFailedException: 401 did not equal 200
      at org.scalatest.MatchersHelper$.newTestFailedException(MatchersHelper.scala:160)
      at org.scalatest.MustMatchers$AnyMustWrapper.mustEqual(MustMatchers.scala:6213)
      at integration.DatasetsAPIAppSpec$$anonfun$2$$anonfun$apply$mcV$sp$4.apply$mcV$sp(DatasetsAPIAppSpec.scala:117)
      at integration.DatasetsAPIAppSpec$$anonfun$2$$anonfun$apply$mcV$sp$4.apply(DatasetsAPIAppSpec.scala:100)
      at integration.DatasetsAPIAppSpec$$anonfun$2$$anonfun$apply$mcV$sp$4.apply(DatasetsAPIAppSpec.scala:100)
(46 more lines...)
class org.scalatest.exceptions.TestFailedException: "[]" did not include substring "datasetname"

      org.scalatest.exceptions.TestFailedException: "[]" did not include substring "datasetname"
      at org.scalatest.MatchersHelper$.newTestFailedException(MatchersHelper.scala:160)
      at org.scalatest.MustMatchers$MustMethodHelper$.mustMatcher(MustMatchers.scala:6141)
      at org.scalatest.MustMatchers$AnyMustWrapper.must(MustMatchers.scala:6175)
      at integration.DatasetsAPIAppSpec$$anonfun$2$$anonfun$apply$mcV$sp$6.apply$mcV$sp(DatasetsAPIAppSpec.scala:180)
      at integration.DatasetsAPIAppSpec$$anonfun$2$$anonfun$apply$mcV$sp$6.apply(DatasetsAPIAppSpec.scala:171)
(47 more lines...)
class org.scalatest.exceptions.TestFailedException: "[]" did not include substring "datasetname"

      org.scalatest.exceptions.TestFailedException: "[]" did not include substring "datasetname"
      at org.scalatest.MatchersHelper$.newTestFailedException(MatchersHelper.scala:160)
      at org.scalatest.MustMatchers$MustMethodHelper$.mustMatcher(MustMatchers.scala:6141)
      at org.scalatest.MustMatchers$AnyMustWrapper.must(MustMatchers.scala:6175)
      at integration.DatasetsAPIAppSpec$$anonfun$2$$anonfun$apply$mcV$sp$7.apply$mcV$sp(DatasetsAPIAppSpec.scala:222)
      at integration.DatasetsAPIAppSpec$$anonfun$2$$anonfun$apply$mcV$sp$7.apply(DatasetsAPIAppSpec.scala:213)
(47 more lines...)
class org.scalatest.exceptions.TestFailedException: "[]" did not include substring "datasetname"

      org.scalatest.exceptions.TestFailedException: "[]" did not include substring "datasetname"
      at org.scalatest.MatchersHelper$.newTestFailedException(MatchersHelper.scala:160)
      at org.scalatest.MustMatchers$MustMethodHelper$.mustMatcher(MustMatchers.scala:6141)
      at org.scalatest.MustMatchers$AnyMustWrapper.must(MustMatchers.scala:6175)
      at integration.DatasetsAPIAppSpec$$anonfun$2$$anonfun$apply$mcV$sp$21.apply$mcV$sp(DatasetsAPIAppSpec.scala:1006)
      at integration.DatasetsAPIAppSpec$$anonfun$2$$anonfun$apply$mcV$sp$21.apply(DatasetsAPIAppSpec.scala:997)
(47 more lines...)
class org.scalatest.exceptions.TestFailedException: "[]" did not include substring "datasetname"

      org.scalatest.exceptions.TestFailedException: "[]" did not include substring "datasetname"
      at org.scalatest.MatchersHelper$.newTestFailedException(MatchersHelper.scala:160)
      at org.scalatest.MustMatchers$MustMethodHelper$.mustMatcher(MustMatchers.scala:6141)
      at org.scalatest.MustMatchers$AnyMustWrapper.must(MustMatchers.scala:6175)
      at integration.DatasetsAPIAppSpec$$anonfun$2$$anonfun$apply$mcV$sp$12.apply$mcV$sp(DatasetsAPIAppSpec.scala:461)
      at integration.DatasetsAPIAppSpec$$anonfun$2$$anonfun$apply$mcV$sp$12.apply(DatasetsAPIAppSpec.scala:452)
(47 more lines...)
class org.scalatest.exceptions.TestFailedException: "[]" did not include substring "datasetname"

      org.scalatest.exceptions.TestFailedException: "[]" did not include substring "datasetname"
      at org.scalatest.MatchersHelper$.newTestFailedException(MatchersHelper.scala:160)
      at org.scalatest.MustMatchers$MustMethodHelper$.mustMatcher(MustMatchers.scala:6141)
      at org.scalatest.MustMatchers$AnyMustWrapper.must(MustMatchers.scala:6175)
      at integration.DatasetsAPIAppSpec$$anonfun$2$$anonfun$apply$mcV$sp$18.apply$mcV$sp(DatasetsAPIAppSpec.scala:862)
      at integration.DatasetsAPIAppSpec$$anonfun$2$$anonfun$apply$mcV$sp$18.apply(DatasetsAPIAppSpec.scala:855)
(47 more lines...)
class org.scalatest.exceptions.TestFailedException: "[]" did not include substring "datasetname"

      org.scalatest.exceptions.TestFailedException: "[]" did not include substring "datasetname"
      at org.scalatest.MatchersHelper$.newTestFailedException(MatchersHelper.scala:160)
      at org.scalatest.MustMatchers$MustMethodHelper$.mustMatcher(MustMatchers.scala:6141)
      at org.scalatest.MustMatchers$AnyMustWrapper.must(MustMatchers.scala:6175)
      at integration.DatasetsAPIAppSpec$$anonfun$2$$anonfun$apply$mcV$sp$17.apply$mcV$sp(DatasetsAPIAppSpec.scala:824)
      at integration.DatasetsAPIAppSpec$$anonfun$2$$anonfun$apply$mcV$sp$17.apply(DatasetsAPIAppSpec.scala:817)
(47 more lines...)
class org.scalatest.exceptions.TestFailedException: "[]" did not include substring "description"

      org.scalatest.exceptions.TestFailedException: "[]" did not include substring "description"
      at org.scalatest.MatchersHelper$.newTestFailedException(MatchersHelper.scala:160)
      at org.scalatest.MustMatchers$MustMethodHelper$.mustMatcher(MustMatchers.scala:6141)
      at org.scalatest.MustMatchers$AnyMustWrapper.must(MustMatchers.scala:6175)
      at integration.DatasetsAPIAppSpec$$anonfun$2$$anonfun$apply$mcV$sp$5.apply$mcV$sp(DatasetsAPIAppSpec.scala:161)
      at integration.DatasetsAPIAppSpec$$anonfun$2$$anonfun$apply$mcV$sp$5.apply(DatasetsAPIAppSpec.scala:154)
(47 more lines...)
class org.scalatest.exceptions.TestFailedException: "[]" did not include substring "datasetname"

      org.scalatest.exceptions.TestFailedException: "[]" did not include substring "datasetname"
      at org.scalatest.MatchersHelper$.newTestFailedException(MatchersHelper.scala:160)
      at org.scalatest.MustMatchers$MustMethodHelper$.mustMatcher(MustMatchers.scala:6141)
      at org.scalatest.MustMatchers$AnyMustWrapper.must(MustMatchers.scala:6175)
      at integration.DatasetsAPIAppSpec$$anonfun$2$$anonfun$apply$mcV$sp$14.apply$mcV$sp(DatasetsAPIAppSpec.scala:559)
      at integration.DatasetsAPIAppSpec$$anonfun$2$$anonfun$apply$mcV$sp$14.apply(DatasetsAPIAppSpec.scala:552)
(47 more lines...)
class org.scalatest.exceptions.TestFailedException: "[]" did not include substring "datasetname"

      org.scalatest.exceptions.TestFailedException: "[]" did not include substring "datasetname"
      at org.scalatest.MatchersHelper$.newTestFailedException(MatchersHelper.scala:160)
      at org.scalatest.MustMatchers$MustMethodHelper$.mustMatcher(MustMatchers.scala:6141)
      at org.scalatest.MustMatchers$AnyMustWrapper.must(MustMatchers.scala:6175)
      at integration.DatasetsAPIAppSpec$$anonfun$2$$anonfun$apply$mcV$sp$11.apply$mcV$sp(DatasetsAPIAppSpec.scala:402)
      at integration.DatasetsAPIAppSpec$$anonfun$2$$anonfun$apply$mcV$sp$11.apply(DatasetsAPIAppSpec.scala:395)
(47 more lines...)
class org.scalatest.exceptions.TestFailedException: "[]" did not include substring "datasetname"

      org.scalatest.exceptions.TestFailedException: "[]" did not include substring "datasetname"
      at org.scalatest.MatchersHelper$.newTestFailedException(MatchersHelper.scala:160)
      at org.scalatest.MustMatchers$MustMethodHelper$.mustMatcher(MustMatchers.scala:6141)
      at org.scalatest.MustMatchers$AnyMustWrapper.must(MustMatchers.scala:6175)
      at integration.DatasetsAPIAppSpec$$anonfun$2$$anonfun$apply$mcV$sp$8.apply$mcV$sp(DatasetsAPIAppSpec.scala:261)
      at integration.DatasetsAPIAppSpec$$anonfun$2$$anonfun$apply$mcV$sp$8.apply(DatasetsAPIAppSpec.scala:254)
(47 more lines...)
class org.scalatest.exceptions.TestFailedException: 401 did not equal 200

      org.scalatest.exceptions.TestFailedException: 401 did not equal 200
      at org.scalatest.MatchersHelper$.newTestFailedException(MatchersHelper.scala:160)
      at org.scalatest.MustMatchers$AnyMustWrapper.mustEqual(MustMatchers.scala:6213)
      at integration.ExtractionsAPIAppSpec$$anonfun$2$$anonfun$apply$mcV$sp$12.apply$mcV$sp(ExtractionsAPIAppSpec.scala:195)
      at integration.ExtractionsAPIAppSpec$$anonfun$2$$anonfun$apply$mcV$sp$12.apply(ExtractionsAPIAppSpec.scala:190)
      at integration.ExtractionsAPIAppSpec$$anonfun$2$$anonfun$apply$mcV$sp$12.apply(ExtractionsAPIAppSpec.scala:190)
(46 more lines...)
class org.scalatest.exceptions.TestFailedException: 401 did not equal 200

      org.scalatest.exceptions.TestFailedException: 401 did not equal 200
      at org.scalatest.MatchersHelper$.newTestFailedException(MatchersHelper.scala:160)
      at org.scalatest.MustMatchers$AnyMustWrapper.mustEqual(MustMatchers.scala:6213)
      at integration.ExtractionsAPIAppSpec$$anonfun$2$$anonfun$apply$mcV$sp$11.apply$mcV$sp(ExtractionsAPIAppSpec.scala:153)
      at integration.ExtractionsAPIAppSpec$$anonfun$2$$anonfun$apply$mcV$sp$11.apply(ExtractionsAPIAppSpec.scala:148)
      at integration.ExtractionsAPIAppSpec$$anonfun$2$$anonfun$apply$mcV$sp$11.apply(ExtractionsAPIAppSpec.scala:148)
(46 more lines...)
class org.scalatest.exceptions.TestFailedException: 401 did not equal 200

      org.scalatest.exceptions.TestFailedException: 401 did not equal 200
      at org.scalatest.MatchersHelper$.newTestFailedException(MatchersHelper.scala:160)
      at org.scalatest.MustMatchers$AnyMustWrapper.mustEqual(MustMatchers.scala:6213)
      at integration.FilesAPIAppSpec$$anonfun$2$$anonfun$apply$mcV$sp$8.apply$mcV$sp(FilesAPIAppSpec.scala:159)
      at integration.FilesAPIAppSpec$$anonfun$2$$anonfun$apply$mcV$sp$8.apply(FilesAPIAppSpec.scala:155)
      at integration.FilesAPIAppSpec$$anonfun$2$$anonfun$apply$mcV$sp$8.apply(FilesAPIAppSpec.scala:155)
(46 more lines...)
class org.scalatest.exceptions.TestFailedException: 401 did not equal 200

      org.scalatest.exceptions.TestFailedException: 401 did not equal 200
      at org.scalatest.MatchersHelper$.newTestFailedException(MatchersHelper.scala:160)
      at org.scalatest.MustMatchers$AnyMustWrapper.mustEqual(MustMatchers.scala:6213)
      at integration.FilesAPIAppSpec$$anonfun$2$$anonfun$apply$mcV$sp$9.apply$mcV$sp(FilesAPIAppSpec.scala:215)
      at integration.FilesAPIAppSpec$$anonfun$2$$anonfun$apply$mcV$sp$9.apply(FilesAPIAppSpec.scala:211)
      at integration.FilesAPIAppSpec$$anonfun$2$$anonfun$apply$mcV$sp$9.apply(FilesAPIAppSpec.scala:211)
(46 more lines...)
class org.scalatest.exceptions.TestFailedException: 401 did not equal 200

      org.scalatest.exceptions.TestFailedException: 401 did not equal 200
      at org.scalatest.MatchersHelper$.newTestFailedException(MatchersHelper.scala:160)
      at org.scalatest.MustMatchers$AnyMustWrapper.mustEqual(MustMatchers.scala:6213)
      at integration.FilesAPIAppSpec$$anonfun$2$$anonfun$apply$mcV$sp$13.apply$mcV$sp(FilesAPIAppSpec.scala:370)
      at integration.FilesAPIAppSpec$$anonfun$2$$anonfun$apply$mcV$sp$13.apply(FilesAPIAppSpec.scala:364)
      at integration.FilesAPIAppSpec$$anonfun$2$$anonfun$apply$mcV$sp$13.apply(FilesAPIAppSpec.scala:364)
(46 more lines...)
class org.scalatest.exceptions.TestFailedException: 401 did not equal 200

      org.scalatest.exceptions.TestFailedException: 401 did not equal 200
      at org.scalatest.MatchersHelper$.newTestFailedException(MatchersHelper.scala:160)
      at org.scalatest.MustMatchers$AnyMustWrapper.mustEqual(MustMatchers.scala:6213)
      at integration.FilesAPIAppSpec$$anonfun$2$$anonfun$apply$mcV$sp$10.apply$mcV$sp(FilesAPIAppSpec.scala:270)
      at integration.FilesAPIAppSpec$$anonfun$2$$anonfun$apply$mcV$sp$10.apply(FilesAPIAppSpec.scala:267)
      at integration.FilesAPIAppSpec$$anonfun$2$$anonfun$apply$mcV$sp$10.apply(FilesAPIAppSpec.scala:267)
(46 more lines...)
class org.scalatest.exceptions.TestFailedException: 401 did not equal 200

      org.scalatest.exceptions.TestFailedException: 401 did not equal 200
      at org.scalatest.MatchersHelper$.newTestFailedException(MatchersHelper.scala:160)
      at org.scalatest.MustMatchers$AnyMustWrapper.mustEqual(MustMatchers.scala:6213)
      at integration.FilesAPIAppSpec$$anonfun$2$$anonfun$apply$mcV$sp$7.apply$mcV$sp(FilesAPIAppSpec.scala:144)
      at integration.FilesAPIAppSpec$$anonfun$2$$anonfun$apply$mcV$sp$7.apply(FilesAPIAppSpec.scala:141)
      at integration.FilesAPIAppSpec$$anonfun$2$$anonfun$apply$mcV$sp$7.apply(FilesAPIAppSpec.scala:141)
(46 more lines...)
class org.scalatest.exceptions.TestFailedException: 401 did not equal 200

      org.scalatest.exceptions.TestFailedException: 401 did not equal 200
      at org.scalatest.MatchersHelper$.newTestFailedException(MatchersHelper.scala:160)
      at org.scalatest.MustMatchers$AnyMustWrapper.mustEqual(MustMatchers.scala:6213)
      at integration.FilesAPIAppSpec$$anonfun$2$$anonfun$apply$mcV$sp$15.apply$mcV$sp(FilesAPIAppSpec.scala:484)
      at integration.FilesAPIAppSpec$$anonfun$2$$anonfun$apply$mcV$sp$15.apply(FilesAPIAppSpec.scala:478)
      at integration.FilesAPIAppSpec$$anonfun$2$$anonfun$apply$mcV$sp$15.apply(FilesAPIAppSpec.scala:478)
(46 more lines...)
class org.scalatest.exceptions.TestFailedException: 401 did not equal 200

      org.scalatest.exceptions.TestFailedException: 401 did not equal 200
      at org.scalatest.MatchersHelper$.newTestFailedException(MatchersHelper.scala:160)
      at org.scalatest.MustMatchers$AnyMustWrapper.mustEqual(MustMatchers.scala:6213)
      at integration.FilesAPIAppSpec$$anonfun$2$$anonfun$apply$mcV$sp$14.apply$mcV$sp(FilesAPIAppSpec.scala:439)
      at integration.FilesAPIAppSpec$$anonfun$2$$anonfun$apply$mcV$sp$14.apply(FilesAPIAppSpec.scala:433)
      at integration.FilesAPIAppSpec$$anonfun$2$$anonfun$apply$mcV$sp$14.apply(FilesAPIAppSpec.scala:433)
(46 more lines...)
class org.scalatest.exceptions.TestFailedException: 401 did not equal 200

      org.scalatest.exceptions.TestFailedException: 401 did not equal 200
      at org.scalatest.MatchersHelper$.newTestFailedException(MatchersHelper.scala:160)
      at org.scalatest.MustMatchers$AnyMustWrapper.mustEqual(MustMatchers.scala:6213)
      at integration.PreviewsAPIAppSpec$$anonfun$2$$anonfun$apply$mcV$sp$7.apply$mcV$sp(PreviewsAPIAppSpec.scala:188)
      at integration.PreviewsAPIAppSpec$$anonfun$2$$anonfun$apply$mcV$sp$7.apply(PreviewsAPIAppSpec.scala:183)
      at integration.PreviewsAPIAppSpec$$anonfun$2$$anonfun$apply$mcV$sp$7.apply(PreviewsAPIAppSpec.scala:183)
(46 more lines...)
class org.scalatest.exceptions.TestFailedException: 401 did not equal 200

      org.scalatest.exceptions.TestFailedException: 401 did not equal 200
      at org.scalatest.MatchersHelper$.newTestFailedException(MatchersHelper.scala:160)
      at org.scalatest.MustMatchers$AnyMustWrapper.mustEqual(MustMatchers.scala:6213)
      at integration.PreviewsAPIAppSpec$$anonfun$2$$anonfun$apply$mcV$sp$8.apply$mcV$sp(PreviewsAPIAppSpec.scala:274)
      at integration.PreviewsAPIAppSpec$$anonfun$2$$anonfun$apply$mcV$sp$8.apply(PreviewsAPIAppSpec.scala:269)
      at integration.PreviewsAPIAppSpec$$anonfun$2$$anonfun$apply$mcV$sp$8.apply(PreviewsAPIAppSpec.scala:269)
(46 more lines...)
class org.scalatest.exceptions.TestFailedException: 401 did not equal 200

      org.scalatest.exceptions.TestFailedException: 401 did not equal 200
      at org.scalatest.MatchersHelper$.newTestFailedException(MatchersHelper.scala:160)
      at org.scalatest.MustMatchers$AnyMustWrapper.mustEqual(MustMatchers.scala:6213)
      at integration.PreviewsAPIAppSpec$$anonfun$2$$anonfun$apply$mcV$sp$9.apply$mcV$sp(PreviewsAPIAppSpec.scala:317)
      at integration.PreviewsAPIAppSpec$$anonfun$2$$anonfun$apply$mcV$sp$9.apply(PreviewsAPIAppSpec.scala:312)
      at integration.PreviewsAPIAppSpec$$anonfun$2$$anonfun$apply$mcV$sp$9.apply(PreviewsAPIAppSpec.scala:312)
(46 more lines...)
class org.scalatest.exceptions.TestFailedException: 401 did not equal 200

      org.scalatest.exceptions.TestFailedException: 401 did not equal 200
      at org.scalatest.MatchersHelper$.newTestFailedException(MatchersHelper.scala:160)
      at org.scalatest.MustMatchers$AnyMustWrapper.mustEqual(MustMatchers.scala:6213)
      at integration.PreviewsAPIAppSpec$$anonfun$2$$anonfun$apply$mcV$sp$15.apply$mcV$sp(PreviewsAPIAppSpec.scala:531)
      at integration.PreviewsAPIAppSpec$$anonfun$2$$anonfun$apply$mcV$sp$15.apply(PreviewsAPIAppSpec.scala:526)
      at integration.PreviewsAPIAppSpec$$anonfun$2$$anonfun$apply$mcV$sp$15.apply(PreviewsAPIAppSpec.scala:526)
(46 more lines...)
class java.lang.ArrayIndexOutOfBoundsException: 2

      java.lang.ArrayIndexOutOfBoundsException: 2
      at integration.PreviewsAPIAppSpec$$anonfun$2$$anonfun$apply$mcV$sp$13.apply$mcV$sp(PreviewsAPIAppSpec.scala:465)
      at integration.PreviewsAPIAppSpec$$anonfun$2$$anonfun$apply$mcV$sp$13.apply(PreviewsAPIAppSpec.scala:445)
      at integration.PreviewsAPIAppSpec$$anonfun$2$$anonfun$apply$mcV$sp$13.apply(PreviewsAPIAppSpec.scala:445)
      at org.scalatest.Transformer$$anonfun$apply$1.apply(Transformer.scala:22)
      at org.scalatest.Transformer$$anonfun$apply$1.apply(Transformer.scala:22)
(45 more lines...)

Error summary

The build generated some errors. See the full build log for more details.

Making output directory...