Build: #1 was successful

Job: default was successful

Stages & jobs

  1. Default Stage

Build log

The build generated 7,422 lines of output.The output is too long and has been truncated to the last 1,000 lines. Download or view full build log.

07-Feb-2019 14:41:10 Setting up mime-support (3.59ubuntu1) ...
07-Feb-2019 14:41:10 Setting up libmpdec2:amd64 (2.4.2-1) ...
07-Feb-2019 14:41:11 Setting up libsqlite3-0:amd64 (3.11.0-1ubuntu1) ...
07-Feb-2019 14:41:12 Setting up libpython3.5-stdlib:amd64 (3.5.2-2ubuntu0~16.04.5) ...
07-Feb-2019 14:41:12 Setting up python3.5 (3.5.2-2ubuntu0~16.04.5) ...
07-Feb-2019 14:41:13 Setting up libpython3-stdlib:amd64 (3.5.1-3) ...
07-Feb-2019 14:41:13 Setting up distro-info-data (0.28ubuntu0.9) ...
07-Feb-2019 14:41:14 Setting up libmagic1:amd64 (1:5.25-2ubuntu1.1) ...
07-Feb-2019 14:41:14 Setting up file (1:5.25-2ubuntu1.1) ...
07-Feb-2019 14:41:14 Setting up libffi6:amd64 (3.2.1-4) ...
07-Feb-2019 14:41:15 Setting up libgmp10:amd64 (2:6.1.0+dfsg-2) ...
07-Feb-2019 14:41:15 Setting up libnettle6:amd64 (3.2-1ubuntu0.16.04.1) ...
07-Feb-2019 14:41:15 Setting up libhogweed4:amd64 (3.2-1ubuntu0.16.04.1) ...
07-Feb-2019 14:41:15 Setting up libidn11:amd64 (1.32-3ubuntu1.2) ...
07-Feb-2019 14:41:15 Setting up libp11-kit0:amd64 (0.23.2-5~ubuntu16.04.1) ...
07-Feb-2019 14:41:15 Setting up libtasn1-6:amd64 (4.7-3ubuntu0.16.04.3) ...
07-Feb-2019 14:41:16 Setting up libgnutls30:amd64 (3.4.10-4ubuntu1.4) ...
07-Feb-2019 14:41:16 Setting up openssl (1.0.2g-1ubuntu4.14) ...
07-Feb-2019 14:41:16 Setting up ca-certificates (20170717~16.04.2) ...
07-Feb-2019 14:41:16 debconf: unable to initialize frontend: Dialog
07-Feb-2019 14:41:16 debconf: (TERM is not set, so the dialog frontend is not usable.)
07-Feb-2019 14:41:16 debconf: falling back to frontend: Readline
07-Feb-2019 14:41:16 debconf: unable to initialize frontend: Readline
07-Feb-2019 14:41:16 debconf: (Can't locate Term/ReadLine.pm in @INC (you may need to install the Term::ReadLine module) (@INC contains: /etc/perl /usr/local/lib/x86_64-linux-gnu/perl/5.22.1 /usr/local/share/perl/5.22.1 /usr/lib/x86_64-linux-gnu/perl5/5.22 /usr/share/perl5 /usr/lib/x86_64-linux-gnu/perl/5.22 /usr/share/perl/5.22 /usr/local/lib/site_perl /usr/lib/x86_64-linux-gnu/perl-base .) at /usr/share/perl5/Debconf/FrontEnd/Readline.pm line 7.)
07-Feb-2019 14:41:16 debconf: falling back to frontend: Teletype
07-Feb-2019 14:41:17 Setting up krb5-locales (1.13.2+dfsg-5ubuntu2.1) ...
07-Feb-2019 14:41:18 Setting up libroken18-heimdal:amd64 (1.7~git20150920+dfsg-4ubuntu1.16.04.1) ...
07-Feb-2019 14:41:18 Setting up libasn1-8-heimdal:amd64 (1.7~git20150920+dfsg-4ubuntu1.16.04.1) ...
07-Feb-2019 14:41:18 Setting up libkrb5support0:amd64 (1.13.2+dfsg-5ubuntu2.1) ...
07-Feb-2019 14:41:18 Setting up libk5crypto3:amd64 (1.13.2+dfsg-5ubuntu2.1) ...
07-Feb-2019 14:41:19 Setting up libkeyutils1:amd64 (1.5.9-8ubuntu1) ...
07-Feb-2019 14:41:19 Setting up libkrb5-3:amd64 (1.13.2+dfsg-5ubuntu2.1) ...
07-Feb-2019 14:41:19 Setting up libgssapi-krb5-2:amd64 (1.13.2+dfsg-5ubuntu2.1) ...
07-Feb-2019 14:41:19 Setting up libhcrypto4-heimdal:amd64 (1.7~git20150920+dfsg-4ubuntu1.16.04.1) ...
07-Feb-2019 14:41:19 Setting up libheimbase1-heimdal:amd64 (1.7~git20150920+dfsg-4ubuntu1.16.04.1) ...
07-Feb-2019 14:41:19 Setting up libwind0-heimdal:amd64 (1.7~git20150920+dfsg-4ubuntu1.16.04.1) ...
07-Feb-2019 14:41:20 Setting up libhx509-5-heimdal:amd64 (1.7~git20150920+dfsg-4ubuntu1.16.04.1) ...
07-Feb-2019 14:41:20 Setting up libkrb5-26-heimdal:amd64 (1.7~git20150920+dfsg-4ubuntu1.16.04.1) ...
07-Feb-2019 14:41:20 Setting up libheimntlm0-heimdal:amd64 (1.7~git20150920+dfsg-4ubuntu1.16.04.1) ...
07-Feb-2019 14:41:20 Setting up libgssapi3-heimdal:amd64 (1.7~git20150920+dfsg-4ubuntu1.16.04.1) ...
07-Feb-2019 14:41:20 Setting up libsasl2-modules-db:amd64 (2.1.26.dfsg1-14ubuntu0.1) ...
07-Feb-2019 14:41:20 Setting up libsasl2-2:amd64 (2.1.26.dfsg1-14ubuntu0.1) ...
07-Feb-2019 14:41:20 Setting up libldap-2.4-2:amd64 (2.4.42+dfsg-2ubuntu3.4) ...
07-Feb-2019 14:41:21 Setting up librtmp1:amd64 (2.4+20151223.gitfa8646d-1ubuntu0.1) ...
07-Feb-2019 14:41:21 Setting up libcurl3-gnutls:amd64 (7.47.0-1ubuntu2.12) ...
07-Feb-2019 14:41:21 Setting up libsasl2-modules:amd64 (2.1.26.dfsg1-14ubuntu0.1) ...
07-Feb-2019 14:41:21 Setting up curl (7.47.0-1ubuntu2.12) ...
07-Feb-2019 14:41:21 Setting up netcat-traditional (1.10-41) ...
07-Feb-2019 14:41:22 update-alternatives: using /bin/nc.traditional to provide /bin/nc (nc) in auto mode
07-Feb-2019 14:41:22 Setting up netcat (1.10-41) ...
07-Feb-2019 14:41:22 Setting up python3 (3.5.1-3) ...
07-Feb-2019 14:41:23 running python rtupdate hooks for python3.5...
07-Feb-2019 14:41:23 running python post-rtupdate hooks for python3.5...
07-Feb-2019 14:41:23 Setting up lsb-release (9.20160110ubuntu0.2) ...
07-Feb-2019 14:41:23 Setting up dh-python (2.20151103ubuntu1.1) ...
07-Feb-2019 14:41:24 Processing triggers for libc-bin (2.23-0ubuntu10) ...
07-Feb-2019 14:41:24 Processing triggers for ca-certificates (20170717~16.04.2) ...
07-Feb-2019 14:41:24 Updating certificates in /etc/ssl/certs...
07-Feb-2019 14:41:25 148 added, 0 removed; done.
07-Feb-2019 14:41:25 Running hooks in /etc/ca-certificates/update.d...
07-Feb-2019 14:41:25 done.
07-Feb-2019 14:41:26 Executing: /tmp/tmp.HMWOuRZbX9/gpg.1.sh --keyserver
07-Feb-2019 14:41:26 hkp://keyserver.ubuntu.com:80
07-Feb-2019 14:41:26 --recv
07-Feb-2019 14:41:26 EA312927
07-Feb-2019 14:41:26 gpg: requesting key EA312927 from hkp server keyserver.ubuntu.com
07-Feb-2019 14:41:27 gpg: key EA312927: public key "MongoDB 3.2 Release Signing Key <packaging@mongodb.com>" imported
07-Feb-2019 14:41:27 gpg: key EA312927: public key "Totally Legit Signing Key <mallory@example.org>" imported
07-Feb-2019 14:41:27 gpg: Total number processed: 2
07-Feb-2019 14:41:27 gpg:               imported: 2  (RSA: 2)
07-Feb-2019 14:41:27 deb http://repo.mongodb.org/apt/ubuntu xenial/mongodb-org/3.2 multiverse
07-Feb-2019 14:41:27 Ign:1 http://repo.mongodb.org/apt/ubuntu xenial/mongodb-org/3.2 InRelease
07-Feb-2019 14:41:27 Hit:2 http://archive.ubuntu.com/ubuntu xenial InRelease
07-Feb-2019 14:41:27 Hit:3 http://security.ubuntu.com/ubuntu xenial-security InRelease
07-Feb-2019 14:41:27 Get:4 http://repo.mongodb.org/apt/ubuntu xenial/mongodb-org/3.2 Release [3462 B]
07-Feb-2019 14:41:27 Hit:5 http://archive.ubuntu.com/ubuntu xenial-updates InRelease
07-Feb-2019 14:41:27 Get:6 http://repo.mongodb.org/apt/ubuntu xenial/mongodb-org/3.2 Release.gpg [801 B]
07-Feb-2019 14:41:27 Hit:7 http://archive.ubuntu.com/ubuntu xenial-backports InRelease
07-Feb-2019 14:41:27 Get:8 http://repo.mongodb.org/apt/ubuntu xenial/mongodb-org/3.2/multiverse amd64 Packages [11.2 kB]
07-Feb-2019 14:41:28 Fetched 15.5 kB in 0s (20.7 kB/s)
07-Feb-2019 14:41:28 Reading package lists...
07-Feb-2019 14:41:29 Reading package lists...
07-Feb-2019 14:41:29 Building dependency tree...
07-Feb-2019 14:41:29 Reading state information...
07-Feb-2019 14:41:30 python3 is already the newest version (3.5.1-3).
07-Feb-2019 14:41:30 python3 set to manually installed.
07-Feb-2019 14:41:30 The following additional packages will be installed:
07-Feb-2019 14:41:30   binutils build-essential bzip2 cpp cpp-5 dpkg-dev fakeroot g++ g++-5 gcc
07-Feb-2019 14:41:30   gcc-5 ifupdown iproute2 isc-dhcp-client isc-dhcp-common
07-Feb-2019 14:41:30   libalgorithm-diff-perl libalgorithm-diff-xs-perl libalgorithm-merge-perl
07-Feb-2019 14:41:30   libasan2 libatm1 libatomic1 libc-dev-bin libc6-dev libcc1-0 libcilkrts5
07-Feb-2019 14:41:30   libdns-export162 libdpkg-perl libexpat1-dev libfakeroot
07-Feb-2019 14:41:30   libfile-fcntllock-perl libgcc-5-dev libgdbm3 libgomp1 libisc-export160
07-Feb-2019 14:41:30   libisl15 libitm1 liblsan0 libmnl0 libmpc3 libmpfr4 libmpx0 libperl5.22
07-Feb-2019 14:41:30   libpython3-dev libpython3.5 libpython3.5-dev libquadmath0 libstdc++-5-dev
07-Feb-2019 14:41:30   libtsan0 libubsan0 libxtables11 linux-libc-dev make manpages manpages-dev
07-Feb-2019 14:41:30   mongodb-org-mongos mongodb-org-server mongodb-org-shell mongodb-org-tools
07-Feb-2019 14:41:30   netbase patch perl perl-modules-5.22 python-pip-whl python3-dev
07-Feb-2019 14:41:30   python3-pkg-resources python3-setuptools python3-wheel python3.5-dev rename
07-Feb-2019 14:41:30   xz-utils
07-Feb-2019 14:41:30 Suggested packages:
07-Feb-2019 14:41:30   binutils-doc bzip2-doc cpp-doc gcc-5-locales debian-keyring g++-multilib
07-Feb-2019 14:41:30   g++-5-multilib gcc-5-doc libstdc++6-5-dbg gcc-multilib autoconf automake
07-Feb-2019 14:41:30   libtool flex bison gdb gcc-doc gcc-5-multilib libgcc1-dbg libgomp1-dbg
07-Feb-2019 14:41:30   libitm1-dbg libatomic1-dbg libasan2-dbg liblsan0-dbg libtsan0-dbg
07-Feb-2019 14:41:30   libubsan0-dbg libcilkrts5-dbg libmpx0-dbg libquadmath0-dbg ppp rdnssd
07-Feb-2019 14:41:30   iproute2-doc resolvconf avahi-autoipd isc-dhcp-client-ddns apparmor
07-Feb-2019 14:41:30   glibc-doc libstdc++-5-doc make-doc man-browser ed diffutils-doc perl-doc
07-Feb-2019 14:41:30   libterm-readline-gnu-perl | libterm-readline-perl-perl python-setuptools-doc
07-Feb-2019 14:41:30 The following NEW packages will be installed:
07-Feb-2019 14:41:30   binutils build-essential bzip2 cpp cpp-5 dpkg-dev fakeroot g++ g++-5 gcc
07-Feb-2019 14:41:30   gcc-5 ifupdown iproute iproute2 isc-dhcp-client isc-dhcp-common
07-Feb-2019 14:41:30   libalgorithm-diff-perl libalgorithm-diff-xs-perl libalgorithm-merge-perl
07-Feb-2019 14:41:30   libasan2 libatm1 libatomic1 libc-dev-bin libc6-dev libcc1-0 libcilkrts5
07-Feb-2019 14:41:30   libdns-export162 libdpkg-perl libexpat1-dev libfakeroot
07-Feb-2019 14:41:30   libfile-fcntllock-perl libgcc-5-dev libgdbm3 libgomp1 libisc-export160
07-Feb-2019 14:41:30   libisl15 libitm1 liblsan0 libmnl0 libmpc3 libmpfr4 libmpx0 libperl5.22
07-Feb-2019 14:41:30   libpython3-dev libpython3.5 libpython3.5-dev libquadmath0 libstdc++-5-dev
07-Feb-2019 14:41:30   libtsan0 libubsan0 libxtables11 linux-libc-dev make manpages manpages-dev
07-Feb-2019 14:41:30   mongodb-org mongodb-org-mongos mongodb-org-server mongodb-org-shell
07-Feb-2019 14:41:30   mongodb-org-tools net-tools netbase patch perl perl-modules-5.22
07-Feb-2019 14:41:30   python-pip-whl python3-dev python3-pip python3-pkg-resources
07-Feb-2019 14:41:30   python3-setuptools python3-wheel python3.5-dev rename xz-utils
07-Feb-2019 14:41:30 0 upgraded, 74 newly installed, 0 to remove and 0 not upgraded.
07-Feb-2019 14:41:30 Need to get 140 MB of archives.
07-Feb-2019 14:41:30 After this operation, 469 MB of additional disk space will be used.
07-Feb-2019 14:41:30 Get:1 http://repo.mongodb.org/apt/ubuntu xenial/mongodb-org/3.2/multiverse amd64 mongodb-org-shell amd64 3.2.22 [5278 kB]
07-Feb-2019 14:41:30 Get:2 http://archive.ubuntu.com/ubuntu xenial/main amd64 libatm1 amd64 1:2.5.1-1.5 [24.2 kB]
07-Feb-2019 14:41:30 Get:3 http://archive.ubuntu.com/ubuntu xenial/main amd64 libmnl0 amd64 1.0.3-5 [12.0 kB]
07-Feb-2019 14:41:30 Get:4 http://archive.ubuntu.com/ubuntu xenial/main amd64 libgdbm3 amd64 1.8.3-13.1 [16.9 kB]
07-Feb-2019 14:41:30 Get:5 http://archive.ubuntu.com/ubuntu xenial-updates/main amd64 perl-modules-5.22 all 5.22.1-9ubuntu0.6 [2629 kB]
07-Feb-2019 14:41:30 Get:6 http://repo.mongodb.org/apt/ubuntu xenial/mongodb-org/3.2/multiverse amd64 mongodb-org-server amd64 3.2.22 [10.0 MB]
07-Feb-2019 14:41:31 Get:7 http://archive.ubuntu.com/ubuntu xenial-updates/main amd64 libperl5.22 amd64 5.22.1-9ubuntu0.6 [3405 kB]
07-Feb-2019 14:41:31 Get:8 http://repo.mongodb.org/apt/ubuntu xenial/mongodb-org/3.2/multiverse amd64 mongodb-org-mongos amd64 3.2.22 [4679 kB]
07-Feb-2019 14:41:31 Get:9 http://archive.ubuntu.com/ubuntu xenial-updates/main amd64 perl amd64 5.22.1-9ubuntu0.6 [237 kB]
07-Feb-2019 14:41:31 Get:10 http://archive.ubuntu.com/ubuntu xenial/main amd64 libmpfr4 amd64 3.1.4-1 [191 kB]
07-Feb-2019 14:41:31 Get:11 http://archive.ubuntu.com/ubuntu xenial/main amd64 libmpc3 amd64 1.0.3-1 [39.7 kB]
07-Feb-2019 14:41:31 Get:12 http://archive.ubuntu.com/ubuntu xenial/main amd64 bzip2 amd64 1.0.6-8 [32.7 kB]
07-Feb-2019 14:41:31 Get:13 http://archive.ubuntu.com/ubuntu xenial-updates/main amd64 iproute2 amd64 4.3.0-1ubuntu3.16.04.4 [521 kB]
07-Feb-2019 14:41:31 Get:14 http://archive.ubuntu.com/ubuntu xenial-updates/main amd64 ifupdown amd64 0.8.10ubuntu1.4 [54.9 kB]
07-Feb-2019 14:41:31 Get:15 http://archive.ubuntu.com/ubuntu xenial-updates/main amd64 libisc-export160 amd64 1:9.10.3.dfsg.P4-8ubuntu1.11 [153 kB]
07-Feb-2019 14:41:31 Get:16 http://archive.ubuntu.com/ubuntu xenial-updates/main amd64 libdns-export162 amd64 1:9.10.3.dfsg.P4-8ubuntu1.11 [667 kB]
07-Feb-2019 14:41:31 Get:17 http://archive.ubuntu.com/ubuntu xenial-updates/main amd64 isc-dhcp-client amd64 4.3.3-5ubuntu12.10 [224 kB]
07-Feb-2019 14:41:31 Get:18 http://archive.ubuntu.com/ubuntu xenial-updates/main amd64 isc-dhcp-common amd64 4.3.3-5ubuntu12.10 [105 kB]
07-Feb-2019 14:41:31 Get:19 http://repo.mongodb.org/apt/ubuntu xenial/mongodb-org/3.2/multiverse amd64 mongodb-org-tools amd64 3.2.22 [31.8 MB]
07-Feb-2019 14:41:31 Get:20 http://archive.ubuntu.com/ubuntu xenial/main amd64 libxtables11 amd64 1.6.0-2ubuntu3 [27.2 kB]
07-Feb-2019 14:41:31 Get:21 http://archive.ubuntu.com/ubuntu xenial/main amd64 net-tools amd64 1.60-26ubuntu1 [175 kB]
07-Feb-2019 14:41:31 Get:22 http://archive.ubuntu.com/ubuntu xenial/main amd64 netbase all 5.3 [12.9 kB]
07-Feb-2019 14:41:31 Get:23 http://archive.ubuntu.com/ubuntu xenial/main amd64 manpages all 4.04-2 [1087 kB]
07-Feb-2019 14:41:31 Get:24 http://archive.ubuntu.com/ubuntu xenial-updates/main amd64 binutils amd64 2.26.1-1ubuntu1~16.04.7 [2309 kB]
07-Feb-2019 14:41:31 Get:25 http://archive.ubuntu.com/ubuntu xenial-updates/main amd64 libc-dev-bin amd64 2.23-0ubuntu10 [68.7 kB]
07-Feb-2019 14:41:31 Get:26 http://archive.ubuntu.com/ubuntu xenial-updates/main amd64 linux-libc-dev amd64 4.4.0-142.168 [867 kB]
07-Feb-2019 14:41:31 Get:27 http://archive.ubuntu.com/ubuntu xenial-updates/main amd64 libc6-dev amd64 2.23-0ubuntu10 [2079 kB]
07-Feb-2019 14:41:31 Get:28 http://archive.ubuntu.com/ubuntu xenial/main amd64 libisl15 amd64 0.16.1-1 [524 kB]
07-Feb-2019 14:41:31 Get:29 http://archive.ubuntu.com/ubuntu xenial-updates/main amd64 cpp-5 amd64 5.4.0-6ubuntu1~16.04.11 [7660 kB]
07-Feb-2019 14:41:32 Get:30 http://archive.ubuntu.com/ubuntu xenial/main amd64 cpp amd64 4:5.3.1-1ubuntu1 [27.7 kB]
07-Feb-2019 14:41:32 Get:31 http://archive.ubuntu.com/ubuntu xenial-updates/main amd64 libcc1-0 amd64 5.4.0-6ubuntu1~16.04.11 [38.8 kB]
07-Feb-2019 14:41:32 Get:32 http://archive.ubuntu.com/ubuntu xenial-updates/main amd64 libgomp1 amd64 5.4.0-6ubuntu1~16.04.11 [55.0 kB]
07-Feb-2019 14:41:32 Get:33 http://archive.ubuntu.com/ubuntu xenial-updates/main amd64 libitm1 amd64 5.4.0-6ubuntu1~16.04.11 [27.4 kB]
07-Feb-2019 14:41:32 Get:34 http://archive.ubuntu.com/ubuntu xenial-updates/main amd64 libatomic1 amd64 5.4.0-6ubuntu1~16.04.11 [8896 B]
07-Feb-2019 14:41:32 Get:35 http://archive.ubuntu.com/ubuntu xenial-updates/main amd64 libasan2 amd64 5.4.0-6ubuntu1~16.04.11 [264 kB]
07-Feb-2019 14:41:32 Get:36 http://archive.ubuntu.com/ubuntu xenial-updates/main amd64 liblsan0 amd64 5.4.0-6ubuntu1~16.04.11 [105 kB]
07-Feb-2019 14:41:32 Get:37 http://archive.ubuntu.com/ubuntu xenial-updates/main amd64 libtsan0 amd64 5.4.0-6ubuntu1~16.04.11 [244 kB]
07-Feb-2019 14:41:32 Get:38 http://archive.ubuntu.com/ubuntu xenial-updates/main amd64 libubsan0 amd64 5.4.0-6ubuntu1~16.04.11 [95.4 kB]
07-Feb-2019 14:41:32 Get:39 http://archive.ubuntu.com/ubuntu xenial-updates/main amd64 libcilkrts5 amd64 5.4.0-6ubuntu1~16.04.11 [40.1 kB]
07-Feb-2019 14:41:32 Get:40 http://archive.ubuntu.com/ubuntu xenial-updates/main amd64 libmpx0 amd64 5.4.0-6ubuntu1~16.04.11 [9748 B]
07-Feb-2019 14:41:32 Get:41 http://archive.ubuntu.com/ubuntu xenial-updates/main amd64 libquadmath0 amd64 5.4.0-6ubuntu1~16.04.11 [131 kB]
07-Feb-2019 14:41:32 Get:42 http://archive.ubuntu.com/ubuntu xenial-updates/main amd64 libgcc-5-dev amd64 5.4.0-6ubuntu1~16.04.11 [2229 kB]
07-Feb-2019 14:41:32 Get:43 http://repo.mongodb.org/apt/ubuntu xenial/mongodb-org/3.2/multiverse amd64 mongodb-org amd64 3.2.22 [3564 B]
07-Feb-2019 14:41:32 Get:44 http://archive.ubuntu.com/ubuntu xenial-updates/main amd64 gcc-5 amd64 5.4.0-6ubuntu1~16.04.11 [8417 kB]
07-Feb-2019 14:41:32 Get:45 http://archive.ubuntu.com/ubuntu xenial/main amd64 gcc amd64 4:5.3.1-1ubuntu1 [5244 B]
07-Feb-2019 14:41:32 Get:46 http://archive.ubuntu.com/ubuntu xenial-updates/main amd64 libstdc++-5-dev amd64 5.4.0-6ubuntu1~16.04.11 [1426 kB]
07-Feb-2019 14:41:32 Get:47 http://archive.ubuntu.com/ubuntu xenial-updates/main amd64 g++-5 amd64 5.4.0-6ubuntu1~16.04.11 [8310 kB]
07-Feb-2019 14:41:33 Get:48 http://archive.ubuntu.com/ubuntu xenial/main amd64 g++ amd64 4:5.3.1-1ubuntu1 [1504 B]
07-Feb-2019 14:41:33 Get:49 http://archive.ubuntu.com/ubuntu xenial/main amd64 make amd64 4.1-6 [151 kB]
07-Feb-2019 14:41:33 Get:50 http://archive.ubuntu.com/ubuntu xenial-updates/main amd64 libdpkg-perl all 1.18.4ubuntu1.5 [195 kB]
07-Feb-2019 14:41:33 Get:51 http://archive.ubuntu.com/ubuntu xenial/main amd64 xz-utils amd64 5.1.1alpha+20120614-2ubuntu2 [78.8 kB]
07-Feb-2019 14:41:33 Get:52 http://archive.ubuntu.com/ubuntu xenial-updates/main amd64 patch amd64 2.7.5-1ubuntu0.16.04.1 [90.5 kB]
07-Feb-2019 14:41:33 Get:53 http://archive.ubuntu.com/ubuntu xenial-updates/main amd64 dpkg-dev all 1.18.4ubuntu1.5 [584 kB]
07-Feb-2019 14:41:33 Get:54 http://archive.ubuntu.com/ubuntu xenial/main amd64 build-essential amd64 12.1ubuntu2 [4758 B]
07-Feb-2019 14:41:33 Get:55 http://archive.ubuntu.com/ubuntu xenial/main amd64 libfakeroot amd64 1.20.2-1ubuntu1 [25.5 kB]
07-Feb-2019 14:41:33 Get:56 http://archive.ubuntu.com/ubuntu xenial/main amd64 fakeroot amd64 1.20.2-1ubuntu1 [61.8 kB]
07-Feb-2019 14:41:33 Get:57 http://archive.ubuntu.com/ubuntu xenial-updates/main amd64 iproute all 1:4.3.0-1ubuntu3.16.04.4 [2438 B]
07-Feb-2019 14:41:33 Get:58 http://archive.ubuntu.com/ubuntu xenial/main amd64 libalgorithm-diff-perl all 1.19.03-1 [47.6 kB]
07-Feb-2019 14:41:33 Get:59 http://archive.ubuntu.com/ubuntu xenial/main amd64 libalgorithm-diff-xs-perl amd64 0.04-4build1 [11.0 kB]
07-Feb-2019 14:41:33 Get:60 http://archive.ubuntu.com/ubuntu xenial/main amd64 libalgorithm-merge-perl all 0.08-3 [12.0 kB]
07-Feb-2019 14:41:33 Get:61 http://archive.ubuntu.com/ubuntu xenial-updates/main amd64 libexpat1-dev amd64 2.1.0-7ubuntu0.16.04.3 [115 kB]
07-Feb-2019 14:41:33 Get:62 http://archive.ubuntu.com/ubuntu xenial/main amd64 libfile-fcntllock-perl amd64 0.22-3 [32.0 kB]
07-Feb-2019 14:41:33 Get:63 http://archive.ubuntu.com/ubuntu xenial-updates/main amd64 libpython3.5 amd64 3.5.2-2ubuntu0~16.04.5 [1360 kB]
07-Feb-2019 14:41:33 Get:64 http://archive.ubuntu.com/ubuntu xenial-updates/main amd64 libpython3.5-dev amd64 3.5.2-2ubuntu0~16.04.5 [37.3 MB]
07-Feb-2019 14:41:34 Get:65 http://archive.ubuntu.com/ubuntu xenial/main amd64 libpython3-dev amd64 3.5.1-3 [6926 B]
07-Feb-2019 14:41:34 Get:66 http://archive.ubuntu.com/ubuntu xenial/main amd64 manpages-dev all 4.04-2 [2048 kB]
07-Feb-2019 14:41:34 Get:67 http://archive.ubuntu.com/ubuntu xenial-updates/universe amd64 python-pip-whl all 8.1.1-2ubuntu0.4 [1110 kB]
07-Feb-2019 14:41:34 Get:68 http://archive.ubuntu.com/ubuntu xenial-updates/main amd64 python3.5-dev amd64 3.5.2-2ubuntu0~16.04.5 [413 kB]
07-Feb-2019 14:41:34 Get:69 http://archive.ubuntu.com/ubuntu xenial/main amd64 python3-dev amd64 3.5.1-3 [1186 B]
07-Feb-2019 14:41:34 Get:70 http://archive.ubuntu.com/ubuntu xenial-updates/universe amd64 python3-pip all 8.1.1-2ubuntu0.4 [109 kB]
07-Feb-2019 14:41:34 Get:71 http://archive.ubuntu.com/ubuntu xenial/main amd64 python3-pkg-resources all 20.7.0-1 [79.0 kB]
07-Feb-2019 14:41:34 Get:72 http://archive.ubuntu.com/ubuntu xenial/main amd64 python3-setuptools all 20.7.0-1 [88.0 kB]
07-Feb-2019 14:41:34 Get:73 http://archive.ubuntu.com/ubuntu xenial/universe amd64 python3-wheel all 0.29.0-1 [48.1 kB]
07-Feb-2019 14:41:34 Get:74 http://archive.ubuntu.com/ubuntu xenial/main amd64 rename all 0.20-4 [12.0 kB]
07-Feb-2019 14:41:34 debconf: delaying package configuration, since apt-utils is not installed
07-Feb-2019 14:41:34 Fetched 140 MB in 4s (29.9 MB/s)
07-Feb-2019 14:41:35 Selecting previously unselected package libatm1:amd64.
07-Feb-2019 14:41:35 (Reading database ...
07-Feb-2019 14:41:35 (Reading database ... 5%
07-Feb-2019 14:41:35 (Reading database ... 10%
07-Feb-2019 14:41:35 (Reading database ... 15%
07-Feb-2019 14:41:35 (Reading database ... 20%
07-Feb-2019 14:41:35 (Reading database ... 25%
07-Feb-2019 14:41:35 (Reading database ... 30%
07-Feb-2019 14:41:35 (Reading database ... 35%
07-Feb-2019 14:41:35 (Reading database ... 40%
07-Feb-2019 14:41:35 (Reading database ... 45%
07-Feb-2019 14:41:35 (Reading database ... 50%
07-Feb-2019 14:41:35 (Reading database ... 55%
07-Feb-2019 14:41:35 (Reading database ... 60%
07-Feb-2019 14:41:35 (Reading database ... 65%
07-Feb-2019 14:41:35 (Reading database ... 70%
07-Feb-2019 14:41:35 (Reading database ... 75%
07-Feb-2019 14:41:35 (Reading database ... 80%
07-Feb-2019 14:41:35 (Reading database ... 85%
07-Feb-2019 14:41:35 (Reading database ... 90%
07-Feb-2019 14:41:35 (Reading database ... 95%
07-Feb-2019 14:41:35 (Reading database ... 100%
07-Feb-2019 14:41:35 (Reading database ... 6336 files and directories currently installed.)
07-Feb-2019 14:41:35 Preparing to unpack .../libatm1_1%3a2.5.1-1.5_amd64.deb ...
07-Feb-2019 14:41:35 Unpacking libatm1:amd64 (1:2.5.1-1.5) ...
07-Feb-2019 14:41:36 Selecting previously unselected package libmnl0:amd64.
07-Feb-2019 14:41:36 Preparing to unpack .../libmnl0_1.0.3-5_amd64.deb ...
07-Feb-2019 14:41:36 Unpacking libmnl0:amd64 (1.0.3-5) ...
07-Feb-2019 14:41:36 Selecting previously unselected package libgdbm3:amd64.
07-Feb-2019 14:41:36 Preparing to unpack .../libgdbm3_1.8.3-13.1_amd64.deb ...
07-Feb-2019 14:41:36 Unpacking libgdbm3:amd64 (1.8.3-13.1) ...
07-Feb-2019 14:41:37 Selecting previously unselected package perl-modules-5.22.
07-Feb-2019 14:41:37 Preparing to unpack .../perl-modules-5.22_5.22.1-9ubuntu0.6_all.deb ...
07-Feb-2019 14:41:37 Unpacking perl-modules-5.22 (5.22.1-9ubuntu0.6) ...
07-Feb-2019 14:41:38 Selecting previously unselected package libperl5.22:amd64.
07-Feb-2019 14:41:38 Preparing to unpack .../libperl5.22_5.22.1-9ubuntu0.6_amd64.deb ...
07-Feb-2019 14:41:38 Unpacking libperl5.22:amd64 (5.22.1-9ubuntu0.6) ...
07-Feb-2019 14:41:40 Selecting previously unselected package perl.
07-Feb-2019 14:41:40 Preparing to unpack .../perl_5.22.1-9ubuntu0.6_amd64.deb ...
07-Feb-2019 14:41:40 Unpacking perl (5.22.1-9ubuntu0.6) ...
07-Feb-2019 14:41:41 Selecting previously unselected package libmpfr4:amd64.
07-Feb-2019 14:41:41 Preparing to unpack .../libmpfr4_3.1.4-1_amd64.deb ...
07-Feb-2019 14:41:41 Unpacking libmpfr4:amd64 (3.1.4-1) ...
07-Feb-2019 14:41:41 Selecting previously unselected package libmpc3:amd64.
07-Feb-2019 14:41:41 Preparing to unpack .../libmpc3_1.0.3-1_amd64.deb ...
07-Feb-2019 14:41:41 Unpacking libmpc3:amd64 (1.0.3-1) ...
07-Feb-2019 14:41:41 Selecting previously unselected package bzip2.
07-Feb-2019 14:41:41 Preparing to unpack .../bzip2_1.0.6-8_amd64.deb ...
07-Feb-2019 14:41:41 Unpacking bzip2 (1.0.6-8) ...
07-Feb-2019 14:41:42 Selecting previously unselected package iproute2.
07-Feb-2019 14:41:42 Preparing to unpack .../iproute2_4.3.0-1ubuntu3.16.04.4_amd64.deb ...
07-Feb-2019 14:41:42 Unpacking iproute2 (4.3.0-1ubuntu3.16.04.4) ...
07-Feb-2019 14:41:43 Selecting previously unselected package ifupdown.
07-Feb-2019 14:41:43 Preparing to unpack .../ifupdown_0.8.10ubuntu1.4_amd64.deb ...
07-Feb-2019 14:41:43 Unpacking ifupdown (0.8.10ubuntu1.4) ...
07-Feb-2019 14:41:44 Selecting previously unselected package libisc-export160.
07-Feb-2019 14:41:44 Preparing to unpack .../libisc-export160_1%3a9.10.3.dfsg.P4-8ubuntu1.11_amd64.deb ...
07-Feb-2019 14:41:44 Unpacking libisc-export160 (1:9.10.3.dfsg.P4-8ubuntu1.11) ...
07-Feb-2019 14:41:44 Selecting previously unselected package libdns-export162.
07-Feb-2019 14:41:44 Preparing to unpack .../libdns-export162_1%3a9.10.3.dfsg.P4-8ubuntu1.11_amd64.deb ...
07-Feb-2019 14:41:44 Unpacking libdns-export162 (1:9.10.3.dfsg.P4-8ubuntu1.11) ...
07-Feb-2019 14:41:44 Selecting previously unselected package isc-dhcp-client.
07-Feb-2019 14:41:44 Preparing to unpack .../isc-dhcp-client_4.3.3-5ubuntu12.10_amd64.deb ...
07-Feb-2019 14:41:44 Unpacking isc-dhcp-client (4.3.3-5ubuntu12.10) ...
07-Feb-2019 14:41:45 Selecting previously unselected package isc-dhcp-common.
07-Feb-2019 14:41:45 Preparing to unpack .../isc-dhcp-common_4.3.3-5ubuntu12.10_amd64.deb ...
07-Feb-2019 14:41:45 Unpacking isc-dhcp-common (4.3.3-5ubuntu12.10) ...
07-Feb-2019 14:41:45 Selecting previously unselected package libxtables11:amd64.
07-Feb-2019 14:41:45 Preparing to unpack .../libxtables11_1.6.0-2ubuntu3_amd64.deb ...
07-Feb-2019 14:41:45 Unpacking libxtables11:amd64 (1.6.0-2ubuntu3) ...
07-Feb-2019 14:41:45 Selecting previously unselected package net-tools.
07-Feb-2019 14:41:45 Preparing to unpack .../net-tools_1.60-26ubuntu1_amd64.deb ...
07-Feb-2019 14:41:45 Unpacking net-tools (1.60-26ubuntu1) ...
07-Feb-2019 14:41:46 Selecting previously unselected package netbase.
07-Feb-2019 14:41:46 Preparing to unpack .../archives/netbase_5.3_all.deb ...
07-Feb-2019 14:41:46 Unpacking netbase (5.3) ...
07-Feb-2019 14:41:46 Selecting previously unselected package manpages.
07-Feb-2019 14:41:46 Preparing to unpack .../manpages_4.04-2_all.deb ...
07-Feb-2019 14:41:46 Unpacking manpages (4.04-2) ...
07-Feb-2019 14:41:47 Selecting previously unselected package binutils.
07-Feb-2019 14:41:47 Preparing to unpack .../binutils_2.26.1-1ubuntu1~16.04.7_amd64.deb ...
07-Feb-2019 14:41:47 Unpacking binutils (2.26.1-1ubuntu1~16.04.7) ...
07-Feb-2019 14:41:48 Selecting previously unselected package libc-dev-bin.
07-Feb-2019 14:41:48 Preparing to unpack .../libc-dev-bin_2.23-0ubuntu10_amd64.deb ...
07-Feb-2019 14:41:48 Unpacking libc-dev-bin (2.23-0ubuntu10) ...
07-Feb-2019 14:41:49 Selecting previously unselected package linux-libc-dev:amd64.
07-Feb-2019 14:41:49 Preparing to unpack .../linux-libc-dev_4.4.0-142.168_amd64.deb ...
07-Feb-2019 14:41:49 Unpacking linux-libc-dev:amd64 (4.4.0-142.168) ...
07-Feb-2019 14:41:49 Selecting previously unselected package libc6-dev:amd64.
07-Feb-2019 14:41:49 Preparing to unpack .../libc6-dev_2.23-0ubuntu10_amd64.deb ...
07-Feb-2019 14:41:49 Unpacking libc6-dev:amd64 (2.23-0ubuntu10) ...
07-Feb-2019 14:41:51 Selecting previously unselected package libisl15:amd64.
07-Feb-2019 14:41:51 Preparing to unpack .../libisl15_0.16.1-1_amd64.deb ...
07-Feb-2019 14:41:51 Unpacking libisl15:amd64 (0.16.1-1) ...
07-Feb-2019 14:41:51 Selecting previously unselected package cpp-5.
07-Feb-2019 14:41:51 Preparing to unpack .../cpp-5_5.4.0-6ubuntu1~16.04.11_amd64.deb ...
07-Feb-2019 14:41:52 Unpacking cpp-5 (5.4.0-6ubuntu1~16.04.11) ...
07-Feb-2019 14:41:53 Selecting previously unselected package cpp.
07-Feb-2019 14:41:53 Preparing to unpack .../cpp_4%3a5.3.1-1ubuntu1_amd64.deb ...
07-Feb-2019 14:41:53 Unpacking cpp (4:5.3.1-1ubuntu1) ...
07-Feb-2019 14:41:54 Selecting previously unselected package libcc1-0:amd64.
07-Feb-2019 14:41:54 Preparing to unpack .../libcc1-0_5.4.0-6ubuntu1~16.04.11_amd64.deb ...
07-Feb-2019 14:41:54 Unpacking libcc1-0:amd64 (5.4.0-6ubuntu1~16.04.11) ...
07-Feb-2019 14:41:55 Selecting previously unselected package libgomp1:amd64.
07-Feb-2019 14:41:55 Preparing to unpack .../libgomp1_5.4.0-6ubuntu1~16.04.11_amd64.deb ...
07-Feb-2019 14:41:55 Unpacking libgomp1:amd64 (5.4.0-6ubuntu1~16.04.11) ...
07-Feb-2019 14:41:55 Selecting previously unselected package libitm1:amd64.
07-Feb-2019 14:41:55 Preparing to unpack .../libitm1_5.4.0-6ubuntu1~16.04.11_amd64.deb ...
07-Feb-2019 14:41:55 Unpacking libitm1:amd64 (5.4.0-6ubuntu1~16.04.11) ...
07-Feb-2019 14:41:56 Selecting previously unselected package libatomic1:amd64.
07-Feb-2019 14:41:56 Preparing to unpack .../libatomic1_5.4.0-6ubuntu1~16.04.11_amd64.deb ...
07-Feb-2019 14:41:56 Unpacking libatomic1:amd64 (5.4.0-6ubuntu1~16.04.11) ...
07-Feb-2019 14:41:56 Selecting previously unselected package libasan2:amd64.
07-Feb-2019 14:41:56 Preparing to unpack .../libasan2_5.4.0-6ubuntu1~16.04.11_amd64.deb ...
07-Feb-2019 14:41:56 Unpacking libasan2:amd64 (5.4.0-6ubuntu1~16.04.11) ...
07-Feb-2019 14:41:57 Selecting previously unselected package liblsan0:amd64.
07-Feb-2019 14:41:57 Preparing to unpack .../liblsan0_5.4.0-6ubuntu1~16.04.11_amd64.deb ...
07-Feb-2019 14:41:57 Unpacking liblsan0:amd64 (5.4.0-6ubuntu1~16.04.11) ...
07-Feb-2019 14:41:58 Selecting previously unselected package libtsan0:amd64.
07-Feb-2019 14:41:58 Preparing to unpack .../libtsan0_5.4.0-6ubuntu1~16.04.11_amd64.deb ...
07-Feb-2019 14:41:58 Unpacking libtsan0:amd64 (5.4.0-6ubuntu1~16.04.11) ...
07-Feb-2019 14:41:58 Selecting previously unselected package libubsan0:amd64.
07-Feb-2019 14:41:58 Preparing to unpack .../libubsan0_5.4.0-6ubuntu1~16.04.11_amd64.deb ...
07-Feb-2019 14:41:59 Unpacking libubsan0:amd64 (5.4.0-6ubuntu1~16.04.11) ...
07-Feb-2019 14:41:59 Selecting previously unselected package libcilkrts5:amd64.
07-Feb-2019 14:41:59 Preparing to unpack .../libcilkrts5_5.4.0-6ubuntu1~16.04.11_amd64.deb ...
07-Feb-2019 14:41:59 Unpacking libcilkrts5:amd64 (5.4.0-6ubuntu1~16.04.11) ...
07-Feb-2019 14:41:59 Selecting previously unselected package libmpx0:amd64.
07-Feb-2019 14:41:59 Preparing to unpack .../libmpx0_5.4.0-6ubuntu1~16.04.11_amd64.deb ...
07-Feb-2019 14:41:59 Unpacking libmpx0:amd64 (5.4.0-6ubuntu1~16.04.11) ...
07-Feb-2019 14:42:00 Selecting previously unselected package libquadmath0:amd64.
07-Feb-2019 14:42:00 Preparing to unpack .../libquadmath0_5.4.0-6ubuntu1~16.04.11_amd64.deb ...
07-Feb-2019 14:42:00 Unpacking libquadmath0:amd64 (5.4.0-6ubuntu1~16.04.11) ...
07-Feb-2019 14:42:00 Selecting previously unselected package libgcc-5-dev:amd64.
07-Feb-2019 14:42:00 Preparing to unpack .../libgcc-5-dev_5.4.0-6ubuntu1~16.04.11_amd64.deb ...
07-Feb-2019 14:42:00 Unpacking libgcc-5-dev:amd64 (5.4.0-6ubuntu1~16.04.11) ...
07-Feb-2019 14:42:01 Selecting previously unselected package gcc-5.
07-Feb-2019 14:42:01 Preparing to unpack .../gcc-5_5.4.0-6ubuntu1~16.04.11_amd64.deb ...
07-Feb-2019 14:42:01 Unpacking gcc-5 (5.4.0-6ubuntu1~16.04.11) ...
07-Feb-2019 14:42:03 Selecting previously unselected package gcc.
07-Feb-2019 14:42:03 Preparing to unpack .../gcc_4%3a5.3.1-1ubuntu1_amd64.deb ...
07-Feb-2019 14:42:04 Unpacking gcc (4:5.3.1-1ubuntu1) ...
07-Feb-2019 14:42:04 Selecting previously unselected package libstdc++-5-dev:amd64.
07-Feb-2019 14:42:04 Preparing to unpack .../libstdc++-5-dev_5.4.0-6ubuntu1~16.04.11_amd64.deb ...
07-Feb-2019 14:42:04 Unpacking libstdc++-5-dev:amd64 (5.4.0-6ubuntu1~16.04.11) ...
07-Feb-2019 14:42:05 Selecting previously unselected package g++-5.
07-Feb-2019 14:42:05 Preparing to unpack .../g++-5_5.4.0-6ubuntu1~16.04.11_amd64.deb ...
07-Feb-2019 14:42:05 Unpacking g++-5 (5.4.0-6ubuntu1~16.04.11) ...
07-Feb-2019 14:42:07 Selecting previously unselected package g++.
07-Feb-2019 14:42:07 Preparing to unpack .../g++_4%3a5.3.1-1ubuntu1_amd64.deb ...
07-Feb-2019 14:42:07 Unpacking g++ (4:5.3.1-1ubuntu1) ...
07-Feb-2019 14:42:08 Selecting previously unselected package make.
07-Feb-2019 14:42:08 Preparing to unpack .../archives/make_4.1-6_amd64.deb ...
07-Feb-2019 14:42:08 Unpacking make (4.1-6) ...
07-Feb-2019 14:42:09 Selecting previously unselected package libdpkg-perl.
07-Feb-2019 14:42:09 Preparing to unpack .../libdpkg-perl_1.18.4ubuntu1.5_all.deb ...
07-Feb-2019 14:42:09 Unpacking libdpkg-perl (1.18.4ubuntu1.5) ...
07-Feb-2019 14:42:09 Selecting previously unselected package xz-utils.
07-Feb-2019 14:42:09 Preparing to unpack .../xz-utils_5.1.1alpha+20120614-2ubuntu2_amd64.deb ...
07-Feb-2019 14:42:09 Unpacking xz-utils (5.1.1alpha+20120614-2ubuntu2) ...
07-Feb-2019 14:42:09 Selecting previously unselected package patch.
07-Feb-2019 14:42:09 Preparing to unpack .../patch_2.7.5-1ubuntu0.16.04.1_amd64.deb ...
07-Feb-2019 14:42:09 Unpacking patch (2.7.5-1ubuntu0.16.04.1) ...
07-Feb-2019 14:42:10 Selecting previously unselected package dpkg-dev.
07-Feb-2019 14:42:10 Preparing to unpack .../dpkg-dev_1.18.4ubuntu1.5_all.deb ...
07-Feb-2019 14:42:10 Unpacking dpkg-dev (1.18.4ubuntu1.5) ...
07-Feb-2019 14:42:11 Selecting previously unselected package build-essential.
07-Feb-2019 14:42:11 Preparing to unpack .../build-essential_12.1ubuntu2_amd64.deb ...
07-Feb-2019 14:42:11 Unpacking build-essential (12.1ubuntu2) ...
07-Feb-2019 14:42:11 Selecting previously unselected package libfakeroot:amd64.
07-Feb-2019 14:42:11 Preparing to unpack .../libfakeroot_1.20.2-1ubuntu1_amd64.deb ...
07-Feb-2019 14:42:11 Unpacking libfakeroot:amd64 (1.20.2-1ubuntu1) ...
07-Feb-2019 14:42:12 Selecting previously unselected package fakeroot.
07-Feb-2019 14:42:12 Preparing to unpack .../fakeroot_1.20.2-1ubuntu1_amd64.deb ...
07-Feb-2019 14:42:12 Unpacking fakeroot (1.20.2-1ubuntu1) ...
07-Feb-2019 14:42:12 Selecting previously unselected package iproute.
07-Feb-2019 14:42:12 Preparing to unpack .../iproute_1%3a4.3.0-1ubuntu3.16.04.4_all.deb ...
07-Feb-2019 14:42:12 Unpacking iproute (1:4.3.0-1ubuntu3.16.04.4) ...
07-Feb-2019 14:42:12 Selecting previously unselected package libalgorithm-diff-perl.
07-Feb-2019 14:42:12 Preparing to unpack .../libalgorithm-diff-perl_1.19.03-1_all.deb ...
07-Feb-2019 14:42:12 Unpacking libalgorithm-diff-perl (1.19.03-1) ...
07-Feb-2019 14:42:13 Selecting previously unselected package libalgorithm-diff-xs-perl.
07-Feb-2019 14:42:13 Preparing to unpack .../libalgorithm-diff-xs-perl_0.04-4build1_amd64.deb ...
07-Feb-2019 14:42:13 Unpacking libalgorithm-diff-xs-perl (0.04-4build1) ...
07-Feb-2019 14:42:13 Selecting previously unselected package libalgorithm-merge-perl.
07-Feb-2019 14:42:13 Preparing to unpack .../libalgorithm-merge-perl_0.08-3_all.deb ...
07-Feb-2019 14:42:13 Unpacking libalgorithm-merge-perl (0.08-3) ...
07-Feb-2019 14:42:13 Selecting previously unselected package libexpat1-dev:amd64.
07-Feb-2019 14:42:13 Preparing to unpack .../libexpat1-dev_2.1.0-7ubuntu0.16.04.3_amd64.deb ...
07-Feb-2019 14:42:13 Unpacking libexpat1-dev:amd64 (2.1.0-7ubuntu0.16.04.3) ...
07-Feb-2019 14:42:14 Selecting previously unselected package libfile-fcntllock-perl.
07-Feb-2019 14:42:14 Preparing to unpack .../libfile-fcntllock-perl_0.22-3_amd64.deb ...
07-Feb-2019 14:42:14 Unpacking libfile-fcntllock-perl (0.22-3) ...
07-Feb-2019 14:42:14 Selecting previously unselected package libpython3.5:amd64.
07-Feb-2019 14:42:14 Preparing to unpack .../libpython3.5_3.5.2-2ubuntu0~16.04.5_amd64.deb ...
07-Feb-2019 14:42:14 Unpacking libpython3.5:amd64 (3.5.2-2ubuntu0~16.04.5) ...
07-Feb-2019 14:42:15 Selecting previously unselected package libpython3.5-dev:amd64.
07-Feb-2019 14:42:15 Preparing to unpack .../libpython3.5-dev_3.5.2-2ubuntu0~16.04.5_amd64.deb ...
07-Feb-2019 14:42:15 Unpacking libpython3.5-dev:amd64 (3.5.2-2ubuntu0~16.04.5) ...
07-Feb-2019 14:42:19 Selecting previously unselected package libpython3-dev:amd64.
07-Feb-2019 14:42:19 Preparing to unpack .../libpython3-dev_3.5.1-3_amd64.deb ...
07-Feb-2019 14:42:19 Unpacking libpython3-dev:amd64 (3.5.1-3) ...
07-Feb-2019 14:42:19 Selecting previously unselected package manpages-dev.
07-Feb-2019 14:42:19 Preparing to unpack .../manpages-dev_4.04-2_all.deb ...
07-Feb-2019 14:42:19 Unpacking manpages-dev (4.04-2) ...
07-Feb-2019 14:42:21 Selecting previously unselected package mongodb-org-shell.
07-Feb-2019 14:42:21 Preparing to unpack .../mongodb-org-shell_3.2.22_amd64.deb ...
07-Feb-2019 14:42:21 Unpacking mongodb-org-shell (3.2.22) ...
07-Feb-2019 14:42:22 Selecting previously unselected package mongodb-org-server.
07-Feb-2019 14:42:22 Preparing to unpack .../mongodb-org-server_3.2.22_amd64.deb ...
07-Feb-2019 14:42:22 Unpacking mongodb-org-server (3.2.22) ...
07-Feb-2019 14:42:24 Selecting previously unselected package mongodb-org-mongos.
07-Feb-2019 14:42:24 Preparing to unpack .../mongodb-org-mongos_3.2.22_amd64.deb ...
07-Feb-2019 14:42:24 Unpacking mongodb-org-mongos (3.2.22) ...
07-Feb-2019 14:42:25 Selecting previously unselected package mongodb-org-tools.
07-Feb-2019 14:42:25 Preparing to unpack .../mongodb-org-tools_3.2.22_amd64.deb ...
07-Feb-2019 14:42:25 Unpacking mongodb-org-tools (3.2.22) ...
07-Feb-2019 14:42:30 Selecting previously unselected package mongodb-org.
07-Feb-2019 14:42:30 Preparing to unpack .../mongodb-org_3.2.22_amd64.deb ...
07-Feb-2019 14:42:30 Unpacking mongodb-org (3.2.22) ...
07-Feb-2019 14:42:31 Selecting previously unselected package python-pip-whl.
07-Feb-2019 14:42:31 Preparing to unpack .../python-pip-whl_8.1.1-2ubuntu0.4_all.deb ...
07-Feb-2019 14:42:31 Unpacking python-pip-whl (8.1.1-2ubuntu0.4) ...
07-Feb-2019 14:42:31 Selecting previously unselected package python3.5-dev.
07-Feb-2019 14:42:31 Preparing to unpack .../python3.5-dev_3.5.2-2ubuntu0~16.04.5_amd64.deb ...
07-Feb-2019 14:42:31 Unpacking python3.5-dev (3.5.2-2ubuntu0~16.04.5) ...
07-Feb-2019 14:42:31 Selecting previously unselected package python3-dev.
07-Feb-2019 14:42:31 Preparing to unpack .../python3-dev_3.5.1-3_amd64.deb ...
07-Feb-2019 14:42:32 Unpacking python3-dev (3.5.1-3) ...
07-Feb-2019 14:42:32 Selecting previously unselected package python3-pip.
07-Feb-2019 14:42:32 Preparing to unpack .../python3-pip_8.1.1-2ubuntu0.4_all.deb ...
07-Feb-2019 14:42:32 Unpacking python3-pip (8.1.1-2ubuntu0.4) ...
07-Feb-2019 14:42:32 Selecting previously unselected package python3-pkg-resources.
07-Feb-2019 14:42:32 Preparing to unpack .../python3-pkg-resources_20.7.0-1_all.deb ...
07-Feb-2019 14:42:32 Unpacking python3-pkg-resources (20.7.0-1) ...
07-Feb-2019 14:42:33 Selecting previously unselected package python3-setuptools.
07-Feb-2019 14:42:33 Preparing to unpack .../python3-setuptools_20.7.0-1_all.deb ...
07-Feb-2019 14:42:33 Unpacking python3-setuptools (20.7.0-1) ...
07-Feb-2019 14:42:33 Selecting previously unselected package python3-wheel.
07-Feb-2019 14:42:33 Preparing to unpack .../python3-wheel_0.29.0-1_all.deb ...
07-Feb-2019 14:42:34 Unpacking python3-wheel (0.29.0-1) ...
07-Feb-2019 14:42:34 Selecting previously unselected package rename.
07-Feb-2019 14:42:34 Preparing to unpack .../archives/rename_0.20-4_all.deb ...
07-Feb-2019 14:42:34 Unpacking rename (0.20-4) ...
07-Feb-2019 14:42:35 Processing triggers for libc-bin (2.23-0ubuntu10) ...
07-Feb-2019 14:42:35 Processing triggers for systemd (229-4ubuntu21.15) ...
07-Feb-2019 14:42:35 Setting up libatm1:amd64 (1:2.5.1-1.5) ...
07-Feb-2019 14:42:35 Setting up libmnl0:amd64 (1.0.3-5) ...
07-Feb-2019 14:42:35 Setting up libgdbm3:amd64 (1.8.3-13.1) ...
07-Feb-2019 14:42:36 Setting up perl-modules-5.22 (5.22.1-9ubuntu0.6) ...
07-Feb-2019 14:42:36 Setting up libperl5.22:amd64 (5.22.1-9ubuntu0.6) ...
07-Feb-2019 14:42:36 Setting up perl (5.22.1-9ubuntu0.6) ...
07-Feb-2019 14:42:36 update-alternatives: using /usr/bin/prename to provide /usr/bin/rename (rename) in auto mode
07-Feb-2019 14:42:36 Setting up libmpfr4:amd64 (3.1.4-1) ...
07-Feb-2019 14:42:36 Setting up libmpc3:amd64 (1.0.3-1) ...
07-Feb-2019 14:42:37 Setting up bzip2 (1.0.6-8) ...
07-Feb-2019 14:42:37 Setting up iproute2 (4.3.0-1ubuntu3.16.04.4) ...
07-Feb-2019 14:42:37 Setting up ifupdown (0.8.10ubuntu1.4) ...
07-Feb-2019 14:42:38 Creating /etc/network/interfaces.
07-Feb-2019 14:42:39 Setting up libisc-export160 (1:9.10.3.dfsg.P4-8ubuntu1.11) ...
07-Feb-2019 14:42:39 Setting up libdns-export162 (1:9.10.3.dfsg.P4-8ubuntu1.11) ...
07-Feb-2019 14:42:39 Setting up isc-dhcp-client (4.3.3-5ubuntu12.10) ...
07-Feb-2019 14:42:40 Setting up isc-dhcp-common (4.3.3-5ubuntu12.10) ...
07-Feb-2019 14:42:40 Setting up libxtables11:amd64 (1.6.0-2ubuntu3) ...
07-Feb-2019 14:42:40 Setting up net-tools (1.60-26ubuntu1) ...
07-Feb-2019 14:42:40 Setting up netbase (5.3) ...
07-Feb-2019 14:42:41 Setting up manpages (4.04-2) ...
07-Feb-2019 14:42:41 Setting up binutils (2.26.1-1ubuntu1~16.04.7) ...
07-Feb-2019 14:42:41 Setting up libc-dev-bin (2.23-0ubuntu10) ...
07-Feb-2019 14:42:41 Setting up linux-libc-dev:amd64 (4.4.0-142.168) ...
07-Feb-2019 14:42:41 Setting up libc6-dev:amd64 (2.23-0ubuntu10) ...
07-Feb-2019 14:42:42 Setting up libisl15:amd64 (0.16.1-1) ...
07-Feb-2019 14:42:42 Setting up cpp-5 (5.4.0-6ubuntu1~16.04.11) ...
07-Feb-2019 14:42:42 Setting up cpp (4:5.3.1-1ubuntu1) ...
07-Feb-2019 14:42:42 Setting up libcc1-0:amd64 (5.4.0-6ubuntu1~16.04.11) ...
07-Feb-2019 14:42:42 Setting up libgomp1:amd64 (5.4.0-6ubuntu1~16.04.11) ...
07-Feb-2019 14:42:43 Setting up libitm1:amd64 (5.4.0-6ubuntu1~16.04.11) ...
07-Feb-2019 14:42:43 Setting up libatomic1:amd64 (5.4.0-6ubuntu1~16.04.11) ...
07-Feb-2019 14:42:43 Setting up libasan2:amd64 (5.4.0-6ubuntu1~16.04.11) ...
07-Feb-2019 14:42:44 Setting up liblsan0:amd64 (5.4.0-6ubuntu1~16.04.11) ...
07-Feb-2019 14:42:44 Setting up libtsan0:amd64 (5.4.0-6ubuntu1~16.04.11) ...
07-Feb-2019 14:42:44 Setting up libubsan0:amd64 (5.4.0-6ubuntu1~16.04.11) ...
07-Feb-2019 14:42:44 Setting up libcilkrts5:amd64 (5.4.0-6ubuntu1~16.04.11) ...
07-Feb-2019 14:42:44 Setting up libmpx0:amd64 (5.4.0-6ubuntu1~16.04.11) ...
07-Feb-2019 14:42:44 Setting up libquadmath0:amd64 (5.4.0-6ubuntu1~16.04.11) ...
07-Feb-2019 14:42:44 Setting up libgcc-5-dev:amd64 (5.4.0-6ubuntu1~16.04.11) ...
07-Feb-2019 14:42:45 Setting up gcc-5 (5.4.0-6ubuntu1~16.04.11) ...
07-Feb-2019 14:42:45 Setting up gcc (4:5.3.1-1ubuntu1) ...
07-Feb-2019 14:42:45 Setting up libstdc++-5-dev:amd64 (5.4.0-6ubuntu1~16.04.11) ...
07-Feb-2019 14:42:45 Setting up g++-5 (5.4.0-6ubuntu1~16.04.11) ...
07-Feb-2019 14:42:45 Setting up g++ (4:5.3.1-1ubuntu1) ...
07-Feb-2019 14:42:45 update-alternatives: using /usr/bin/g++ to provide /usr/bin/c++ (c++) in auto mode
07-Feb-2019 14:42:45 Setting up make (4.1-6) ...
07-Feb-2019 14:42:46 Setting up libdpkg-perl (1.18.4ubuntu1.5) ...
07-Feb-2019 14:42:46 Setting up xz-utils (5.1.1alpha+20120614-2ubuntu2) ...
07-Feb-2019 14:42:46 update-alternatives: using /usr/bin/xz to provide /usr/bin/lzma (lzma) in auto mode
07-Feb-2019 14:42:46 Setting up patch (2.7.5-1ubuntu0.16.04.1) ...
07-Feb-2019 14:42:46 Setting up dpkg-dev (1.18.4ubuntu1.5) ...
07-Feb-2019 14:42:46 Setting up build-essential (12.1ubuntu2) ...
07-Feb-2019 14:42:46 Setting up libfakeroot:amd64 (1.20.2-1ubuntu1) ...
07-Feb-2019 14:42:47 Setting up fakeroot (1.20.2-1ubuntu1) ...
07-Feb-2019 14:42:47 update-alternatives: using /usr/bin/fakeroot-sysv to provide /usr/bin/fakeroot (fakeroot) in auto mode
07-Feb-2019 14:42:47 Setting up iproute (1:4.3.0-1ubuntu3.16.04.4) ...
07-Feb-2019 14:42:47 Setting up libalgorithm-diff-perl (1.19.03-1) ...
07-Feb-2019 14:42:47 Setting up libalgorithm-diff-xs-perl (0.04-4build1) ...
07-Feb-2019 14:42:48 Setting up libalgorithm-merge-perl (0.08-3) ...
07-Feb-2019 14:42:48 Setting up libexpat1-dev:amd64 (2.1.0-7ubuntu0.16.04.3) ...
07-Feb-2019 14:42:48 Setting up libfile-fcntllock-perl (0.22-3) ...
07-Feb-2019 14:42:49 Setting up libpython3.5:amd64 (3.5.2-2ubuntu0~16.04.5) ...
07-Feb-2019 14:42:49 Setting up libpython3.5-dev:amd64 (3.5.2-2ubuntu0~16.04.5) ...
07-Feb-2019 14:42:49 Setting up libpython3-dev:amd64 (3.5.1-3) ...
07-Feb-2019 14:42:49 Setting up manpages-dev (4.04-2) ...
07-Feb-2019 14:42:49 Setting up mongodb-org-shell (3.2.22) ...
07-Feb-2019 14:42:49 Setting up mongodb-org-server (3.2.22) ...
07-Feb-2019 14:42:50 Adding system user `mongodb' (UID 105) ...
07-Feb-2019 14:42:50 Adding new user `mongodb' (UID 105) with group `nogroup' ...
07-Feb-2019 14:42:50 Not creating home directory `/home/mongodb'.
07-Feb-2019 14:42:50 Adding group `mongodb' (GID 107) ...
07-Feb-2019 14:42:50 Done.
07-Feb-2019 14:42:50 Adding user `mongodb' to group `mongodb' ...
07-Feb-2019 14:42:50 Adding user mongodb to group mongodb
07-Feb-2019 14:42:50 Done.
07-Feb-2019 14:42:50 Setting up mongodb-org-mongos (3.2.22) ...
07-Feb-2019 14:42:51 Setting up mongodb-org-tools (3.2.22) ...
07-Feb-2019 14:42:51 Setting up mongodb-org (3.2.22) ...
07-Feb-2019 14:42:51 Setting up python-pip-whl (8.1.1-2ubuntu0.4) ...
07-Feb-2019 14:42:51 Setting up python3.5-dev (3.5.2-2ubuntu0~16.04.5) ...
07-Feb-2019 14:42:51 Setting up python3-dev (3.5.1-3) ...
07-Feb-2019 14:42:51 Setting up python3-pip (8.1.1-2ubuntu0.4) ...
07-Feb-2019 14:42:52 Setting up python3-pkg-resources (20.7.0-1) ...
07-Feb-2019 14:42:52 Setting up python3-setuptools (20.7.0-1) ...
07-Feb-2019 14:42:53 Setting up python3-wheel (0.29.0-1) ...
07-Feb-2019 14:42:53 Setting up rename (0.20-4) ...
07-Feb-2019 14:42:54 update-alternatives: using /usr/bin/file-rename to provide /usr/bin/rename (rename) in auto mode
07-Feb-2019 14:42:54 Processing triggers for libc-bin (2.23-0ubuntu10) ...
07-Feb-2019 14:42:54 Processing triggers for systemd (229-4ubuntu21.15) ...
07-Feb-2019 14:42:55 Collecting passlib
07-Feb-2019 14:42:55   Downloading https://files.pythonhosted.org/packages/ee/a7/d6d238d927df355d4e4e000670342ca4705a72f0bf694027cf67d9bcf5af/passlib-1.7.1-py2.py3-none-any.whl (498kB)
07-Feb-2019 14:42:55 Collecting bcrypt
07-Feb-2019 14:42:55   Downloading https://files.pythonhosted.org/packages/ce/3a/3d540b9f5ee8d92ce757eebacf167b9deedb8e30aedec69a2a072b2399bb/bcrypt-3.1.6.tar.gz (42kB)
07-Feb-2019 14:42:56 Collecting cffi>=1.1 (from bcrypt)
07-Feb-2019 14:42:56   Downloading https://files.pythonhosted.org/packages/59/cc/0e1635b4951021ef35f5c92b32c865ae605fac2a19d724fb6ff99d745c81/cffi-1.11.5-cp35-cp35m-manylinux1_x86_64.whl (420kB)
07-Feb-2019 14:42:56 Collecting six>=1.4.1 (from bcrypt)
07-Feb-2019 14:42:56   Downloading https://files.pythonhosted.org/packages/73/fb/00a976f728d0d1fecfe898238ce23f502a721c0ac0ecfedb80e0d88c64e9/six-1.12.0-py2.py3-none-any.whl
07-Feb-2019 14:42:56 Collecting pycparser (from cffi>=1.1->bcrypt)
07-Feb-2019 14:42:56   Downloading https://files.pythonhosted.org/packages/68/9e/49196946aee219aead1290e00d1e7fdeab8567783e83e1b9ab5585e6206a/pycparser-2.19.tar.gz (158kB)
07-Feb-2019 14:42:56 Building wheels for collected packages: bcrypt, pycparser
07-Feb-2019 14:42:56   Running setup.py bdist_wheel for bcrypt: started
07-Feb-2019 14:42:57   Running setup.py bdist_wheel for bcrypt: finished with status 'error'
07-Feb-2019 14:42:57   Complete output from command /usr/bin/python3 -u -c "import setuptools, tokenize;__file__='/tmp/pip-build-wqoivmad/bcrypt/setup.py';exec(compile(getattr(tokenize, 'open', open)(__file__).read().replace('\r\n', '\n'), __file__, 'exec'))" bdist_wheel -d /tmp/tmpt81edu4ypip-wheel- --python-tag cp35:
07-Feb-2019 14:42:57   c/_cffi_backend.c:15:17: fatal error: ffi.h: No such file or directory
07-Feb-2019 14:42:57   compilation terminated.
07-Feb-2019 14:42:57   Traceback (most recent call last):
07-Feb-2019 14:42:57     File "/usr/lib/python3.5/distutils/unixccompiler.py", line 118, in _compile
07-Feb-2019 14:42:57       extra_postargs)
07-Feb-2019 14:42:57     File "/usr/lib/python3.5/distutils/ccompiler.py", line 909, in spawn
07-Feb-2019 14:42:57       spawn(cmd, dry_run=self.dry_run)
07-Feb-2019 14:42:57     File "/usr/lib/python3.5/distutils/spawn.py", line 36, in spawn
07-Feb-2019 14:42:57       _spawn_posix(cmd, search_path, dry_run=dry_run)
07-Feb-2019 14:42:57     File "/usr/lib/python3.5/distutils/spawn.py", line 159, in _spawn_posix
07-Feb-2019 14:42:57       % (cmd, exit_status))
07-Feb-2019 14:42:57   distutils.errors.DistutilsExecError: command 'x86_64-linux-gnu-gcc' failed with exit status 1
07-Feb-2019 14:42:57  
07-Feb-2019 14:42:57   During handling of the above exception, another exception occurred:
07-Feb-2019 14:42:57  
07-Feb-2019 14:42:57   Traceback (most recent call last):
07-Feb-2019 14:42:57     File "/usr/lib/python3.5/distutils/core.py", line 148, in setup
07-Feb-2019 14:42:57       dist.run_commands()
07-Feb-2019 14:42:57     File "/usr/lib/python3.5/distutils/dist.py", line 955, in run_commands
07-Feb-2019 14:42:57       self.run_command(cmd)
07-Feb-2019 14:42:57     File "/usr/lib/python3.5/distutils/dist.py", line 974, in run_command
07-Feb-2019 14:42:57       cmd_obj.run()
07-Feb-2019 14:42:57     File "/usr/lib/python3/dist-packages/setuptools/command/bdist_egg.py", line 161, in run
07-Feb-2019 14:42:57       cmd = self.call_command('install_lib', warn_dir=0)
07-Feb-2019 14:42:57     File "/usr/lib/python3/dist-packages/setuptools/command/bdist_egg.py", line 147, in call_command
07-Feb-2019 14:42:57       self.run_command(cmdname)
07-Feb-2019 14:42:57     File "/usr/lib/python3.5/distutils/cmd.py", line 313, in run_command
07-Feb-2019 14:42:57       self.distribution.run_command(command)
07-Feb-2019 14:42:57     File "/usr/lib/python3.5/distutils/dist.py", line 974, in run_command
07-Feb-2019 14:42:57       cmd_obj.run()
07-Feb-2019 14:42:57     File "/usr/lib/python3/dist-packages/setuptools/command/install_lib.py", line 23, in run
07-Feb-2019 14:42:57       self.build()
07-Feb-2019 14:42:57     File "/usr/lib/python3.5/distutils/command/install_lib.py", line 109, in build
07-Feb-2019 14:42:57       self.run_command('build_ext')
07-Feb-2019 14:42:57     File "/usr/lib/python3.5/distutils/cmd.py", line 313, in run_command
07-Feb-2019 14:42:57       self.distribution.run_command(command)
07-Feb-2019 14:42:57     File "/usr/lib/python3.5/distutils/dist.py", line 974, in run_command
07-Feb-2019 14:42:57       cmd_obj.run()
07-Feb-2019 14:42:57     File "/usr/lib/python3/dist-packages/setuptools/command/build_ext.py", line 49, in run
07-Feb-2019 14:42:57       _build_ext.run(self)
07-Feb-2019 14:42:57     File "/usr/lib/python3.5/distutils/command/build_ext.py", line 338, in run
07-Feb-2019 14:42:57       self.build_extensions()
07-Feb-2019 14:42:57     File "/usr/lib/python3.5/distutils/command/build_ext.py", line 447, in build_extensions
07-Feb-2019 14:42:57       self._build_extensions_serial()
07-Feb-2019 14:42:57     File "/usr/lib/python3.5/distutils/command/build_ext.py", line 472, in _build_extensions_serial
07-Feb-2019 14:42:57       self.build_extension(ext)
07-Feb-2019 14:42:57     File "/usr/lib/python3/dist-packages/setuptools/command/build_ext.py", line 174, in build_extension
07-Feb-2019 14:42:57       _build_ext.build_extension(self, ext)
07-Feb-2019 14:42:57     File "/usr/lib/python3.5/distutils/command/build_ext.py", line 532, in build_extension
07-Feb-2019 14:42:57       depends=ext.depends)
07-Feb-2019 14:42:57     File "/usr/lib/python3.5/distutils/ccompiler.py", line 574, in compile
07-Feb-2019 14:42:57       self._compile(obj, src, ext, cc_args, extra_postargs, pp_opts)
07-Feb-2019 14:42:57     File "/usr/lib/python3.5/distutils/unixccompiler.py", line 120, in _compile
07-Feb-2019 14:42:57       raise CompileError(msg)
07-Feb-2019 14:42:57   distutils.errors.CompileError: command 'x86_64-linux-gnu-gcc' failed with exit status 1
07-Feb-2019 14:42:57  
07-Feb-2019 14:42:57   During handling of the above exception, another exception occurred:
07-Feb-2019 14:42:57  
07-Feb-2019 14:42:57   Traceback (most recent call last):
07-Feb-2019 14:42:57     File "/usr/lib/python3/dist-packages/setuptools/sandbox.py", line 154, in save_modules
07-Feb-2019 14:42:57       yield saved
07-Feb-2019 14:42:57     File "/usr/lib/python3/dist-packages/setuptools/sandbox.py", line 195, in setup_context
07-Feb-2019 14:42:57       yield
07-Feb-2019 14:42:57     File "/usr/lib/python3/dist-packages/setuptools/sandbox.py", line 243, in run_setup
07-Feb-2019 14:42:57       DirectorySandbox(setup_dir).run(runner)
07-Feb-2019 14:42:57     File "/usr/lib/python3/dist-packages/setuptools/sandbox.py", line 273, in run
07-Feb-2019 14:42:57       return func()
07-Feb-2019 14:42:57     File "/usr/lib/python3/dist-packages/setuptools/sandbox.py", line 242, in runner
07-Feb-2019 14:42:57       _execfile(setup_script, ns)
07-Feb-2019 14:42:57     File "/usr/lib/python3/dist-packages/setuptools/sandbox.py", line 46, in _execfile
07-Feb-2019 14:42:57       exec(code, globals, locals)
07-Feb-2019 14:42:57     File "/tmp/easy_install-95vp5pao/cffi-1.11.5/setup.py", line 240, in <module>
07-Feb-2019 14:42:57       **keywords_with_side_effects(sys.argv)
07-Feb-2019 14:42:57     File "/usr/lib/python3.5/distutils/core.py", line 163, in setup
07-Feb-2019 14:42:57       raise SystemExit("error: " + str(msg))
07-Feb-2019 14:42:57   SystemExit: error: command 'x86_64-linux-gnu-gcc' failed with exit status 1
07-Feb-2019 14:42:57  
07-Feb-2019 14:42:57   During handling of the above exception, another exception occurred:
07-Feb-2019 14:42:57  
07-Feb-2019 14:42:57   Traceback (most recent call last):
07-Feb-2019 14:42:57     File "/usr/lib/python3/dist-packages/setuptools/command/easy_install.py", line 1087, in run_setup
07-Feb-2019 14:42:57       run_setup(setup_script, args)
07-Feb-2019 14:42:57     File "/usr/lib/python3/dist-packages/setuptools/sandbox.py", line 246, in run_setup
07-Feb-2019 14:42:57       raise
07-Feb-2019 14:42:57     File "/usr/lib/python3.5/contextlib.py", line 77, in __exit__
07-Feb-2019 14:42:57       self.gen.throw(type, value, traceback)
07-Feb-2019 14:42:57     File "/usr/lib/python3/dist-packages/setuptools/sandbox.py", line 195, in setup_context
07-Feb-2019 14:42:57       yield
07-Feb-2019 14:42:57     File "/usr/lib/python3.5/contextlib.py", line 77, in __exit__
07-Feb-2019 14:42:57       self.gen.throw(type, value, traceback)
07-Feb-2019 14:42:57     File "/usr/lib/python3/dist-packages/setuptools/sandbox.py", line 166, in save_modules
07-Feb-2019 14:42:57       saved_exc.resume()
07-Feb-2019 14:42:57     File "/usr/lib/python3/dist-packages/setuptools/sandbox.py", line 141, in resume
07-Feb-2019 14:42:57       six.reraise(type, exc, self._tb)
07-Feb-2019 14:42:57     File "/usr/lib/python3/dist-packages/pkg_resources/_vendor/six.py", line 685, in reraise
07-Feb-2019 14:42:57       raise value.with_traceback(tb)
07-Feb-2019 14:42:57     File "/usr/lib/python3/dist-packages/setuptools/sandbox.py", line 154, in save_modules
07-Feb-2019 14:42:57       yield saved
07-Feb-2019 14:42:57     File "/usr/lib/python3/dist-packages/setuptools/sandbox.py", line 195, in setup_context
07-Feb-2019 14:42:57       yield
07-Feb-2019 14:42:57     File "/usr/lib/python3/dist-packages/setuptools/sandbox.py", line 243, in run_setup
07-Feb-2019 14:42:57       DirectorySandbox(setup_dir).run(runner)
07-Feb-2019 14:42:57     File "/usr/lib/python3/dist-packages/setuptools/sandbox.py", line 273, in run
07-Feb-2019 14:42:57       return func()
07-Feb-2019 14:42:57     File "/usr/lib/python3/dist-packages/setuptools/sandbox.py", line 242, in runner
07-Feb-2019 14:42:57       _execfile(setup_script, ns)
07-Feb-2019 14:42:57     File "/usr/lib/python3/dist-packages/setuptools/sandbox.py", line 46, in _execfile
07-Feb-2019 14:42:57       exec(code, globals, locals)
07-Feb-2019 14:42:57     File "/tmp/easy_install-95vp5pao/cffi-1.11.5/setup.py", line 240, in <module>
07-Feb-2019 14:42:57       **keywords_with_side_effects(sys.argv)
07-Feb-2019 14:42:57     File "/usr/lib/python3.5/distutils/core.py", line 163, in setup
07-Feb-2019 14:42:57       raise SystemExit("error: " + str(msg))
07-Feb-2019 14:42:57   SystemExit: error: command 'x86_64-linux-gnu-gcc' failed with exit status 1
07-Feb-2019 14:42:57  
07-Feb-2019 14:42:57   During handling of the above exception, another exception occurred:
07-Feb-2019 14:42:57  
07-Feb-2019 14:42:57   Traceback (most recent call last):
07-Feb-2019 14:42:57     File "<string>", line 1, in <module>
07-Feb-2019 14:42:57     File "/tmp/pip-build-wqoivmad/bcrypt/setup.py", line 240, in <module>
07-Feb-2019 14:42:57       **keywords_with_side_effects(sys.argv)
07-Feb-2019 14:42:57     File "/usr/lib/python3.5/distutils/core.py", line 108, in setup
07-Feb-2019 14:42:57       _setup_distribution = dist = klass(attrs)
07-Feb-2019 14:42:57     File "/usr/lib/python3/dist-packages/setuptools/dist.py", line 269, in __init__
07-Feb-2019 14:42:57       self.fetch_build_eggs(attrs['setup_requires'])
07-Feb-2019 14:42:57     File "/usr/lib/python3/dist-packages/setuptools/dist.py", line 313, in fetch_build_eggs
07-Feb-2019 14:42:57       replace_conflicting=True,
07-Feb-2019 14:42:57     File "/usr/lib/python3/dist-packages/pkg_resources/__init__.py", line 826, in resolve
07-Feb-2019 14:42:57       dist = best[req.key] = env.best_match(req, ws, installer)
07-Feb-2019 14:42:57     File "/usr/lib/python3/dist-packages/pkg_resources/__init__.py", line 1092, in best_match
07-Feb-2019 14:42:57       return self.obtain(req, installer)
07-Feb-2019 14:42:57     File "/usr/lib/python3/dist-packages/pkg_resources/__init__.py", line 1104, in obtain
07-Feb-2019 14:42:57       return installer(requirement)
07-Feb-2019 14:42:57     File "/usr/lib/python3/dist-packages/setuptools/dist.py", line 380, in fetch_build_egg
07-Feb-2019 14:42:57       return cmd.easy_install(req)
07-Feb-2019 14:42:57     File "/usr/lib/python3/dist-packages/setuptools/command/easy_install.py", line 663, in easy_install
07-Feb-2019 14:42:57       return self.install_item(spec, dist.location, tmpdir, deps)
07-Feb-2019 14:42:57     File "/usr/lib/python3/dist-packages/setuptools/command/easy_install.py", line 693, in install_item
07-Feb-2019 14:42:57       dists = self.install_eggs(spec, download, tmpdir)
07-Feb-2019 14:42:57     File "/usr/lib/python3/dist-packages/setuptools/command/easy_install.py", line 873, in install_eggs
07-Feb-2019 14:42:57       return self.build_and_install(setup_script, setup_base)
07-Feb-2019 14:42:57     File "/usr/lib/python3/dist-packages/setuptools/command/easy_install.py", line 1101, in build_and_install
07-Feb-2019 14:42:57       self.run_setup(setup_script, setup_base, args)
07-Feb-2019 14:42:57     File "/usr/lib/python3/dist-packages/setuptools/command/easy_install.py", line 1089, in run_setup
07-Feb-2019 14:42:57       raise DistutilsError("Setup script exited with %s" % (v.args[0],))
07-Feb-2019 14:42:57   distutils.errors.DistutilsError: Setup script exited with error: command 'x86_64-linux-gnu-gcc' failed with exit status 1
07-Feb-2019 14:42:57  
07-Feb-2019 14:42:57   ----------------------------------------
07-Feb-2019 14:42:57   Running setup.py clean for bcrypt
07-Feb-2019 14:42:57   Failed building wheel for bcrypt
07-Feb-2019 14:42:58   Complete output from command /usr/bin/python3 -u -c "import setuptools, tokenize;__file__='/tmp/pip-build-wqoivmad/bcrypt/setup.py';exec(compile(getattr(tokenize, 'open', open)(__file__).read().replace('\r\n', '\n'), __file__, 'exec'))" clean --all:
07-Feb-2019 14:42:58   c/_cffi_backend.c:15:17: fatal error: ffi.h: No such file or directory
07-Feb-2019 14:42:58   compilation terminated.
07-Feb-2019 14:42:58   Traceback (most recent call last):
07-Feb-2019 14:42:58     File "/usr/lib/python3.5/distutils/unixccompiler.py", line 118, in _compile
07-Feb-2019 14:42:58       extra_postargs)
07-Feb-2019 14:42:58     File "/usr/lib/python3.5/distutils/ccompiler.py", line 909, in spawn
07-Feb-2019 14:42:58       spawn(cmd, dry_run=self.dry_run)
07-Feb-2019 14:42:58     File "/usr/lib/python3.5/distutils/spawn.py", line 36, in spawn
07-Feb-2019 14:42:58       _spawn_posix(cmd, search_path, dry_run=dry_run)
07-Feb-2019 14:42:58     File "/usr/lib/python3.5/distutils/spawn.py", line 159, in _spawn_posix
07-Feb-2019 14:42:58       % (cmd, exit_status))
07-Feb-2019 14:42:58   distutils.errors.DistutilsExecError: command 'x86_64-linux-gnu-gcc' failed with exit status 1
07-Feb-2019 14:42:58  
07-Feb-2019 14:42:58   During handling of the above exception, another exception occurred:
07-Feb-2019 14:42:58  
07-Feb-2019 14:42:58   Traceback (most recent call last):
07-Feb-2019 14:42:58     File "/usr/lib/python3.5/distutils/core.py", line 148, in setup
07-Feb-2019 14:42:58       dist.run_commands()
07-Feb-2019 14:42:58     File "/usr/lib/python3.5/distutils/dist.py", line 955, in run_commands
07-Feb-2019 14:42:58       self.run_command(cmd)
07-Feb-2019 14:42:58     File "/usr/lib/python3.5/distutils/dist.py", line 974, in run_command
07-Feb-2019 14:42:58       cmd_obj.run()
07-Feb-2019 14:42:58     File "/usr/lib/python3/dist-packages/setuptools/command/bdist_egg.py", line 161, in run
07-Feb-2019 14:42:58       cmd = self.call_command('install_lib', warn_dir=0)
07-Feb-2019 14:42:58     File "/usr/lib/python3/dist-packages/setuptools/command/bdist_egg.py", line 147, in call_command
07-Feb-2019 14:42:58       self.run_command(cmdname)
07-Feb-2019 14:42:58     File "/usr/lib/python3.5/distutils/cmd.py", line 313, in run_command
07-Feb-2019 14:42:58       self.distribution.run_command(command)
07-Feb-2019 14:42:58     File "/usr/lib/python3.5/distutils/dist.py", line 974, in run_command
07-Feb-2019 14:42:58       cmd_obj.run()
07-Feb-2019 14:42:58     File "/usr/lib/python3/dist-packages/setuptools/command/install_lib.py", line 23, in run
07-Feb-2019 14:42:58       self.build()
07-Feb-2019 14:42:58     File "/usr/lib/python3.5/distutils/command/install_lib.py", line 109, in build
07-Feb-2019 14:42:58       self.run_command('build_ext')
07-Feb-2019 14:42:58     File "/usr/lib/python3.5/distutils/cmd.py", line 313, in run_command
07-Feb-2019 14:42:58       self.distribution.run_command(command)
07-Feb-2019 14:42:58     File "/usr/lib/python3.5/distutils/dist.py", line 974, in run_command
07-Feb-2019 14:42:58       cmd_obj.run()
07-Feb-2019 14:42:58     File "/usr/lib/python3/dist-packages/setuptools/command/build_ext.py", line 49, in run
07-Feb-2019 14:42:58       _build_ext.run(self)
07-Feb-2019 14:42:58     File "/usr/lib/python3.5/distutils/command/build_ext.py", line 338, in run
07-Feb-2019 14:42:58       self.build_extensions()
07-Feb-2019 14:42:58     File "/usr/lib/python3.5/distutils/command/build_ext.py", line 447, in build_extensions
07-Feb-2019 14:42:58       self._build_extensions_serial()
07-Feb-2019 14:42:58     File "/usr/lib/python3.5/distutils/command/build_ext.py", line 472, in _build_extensions_serial
07-Feb-2019 14:42:58       self.build_extension(ext)
07-Feb-2019 14:42:58     File "/usr/lib/python3/dist-packages/setuptools/command/build_ext.py", line 174, in build_extension
07-Feb-2019 14:42:58       _build_ext.build_extension(self, ext)
07-Feb-2019 14:42:58     File "/usr/lib/python3.5/distutils/command/build_ext.py", line 532, in build_extension
07-Feb-2019 14:42:58       depends=ext.depends)
07-Feb-2019 14:42:58     File "/usr/lib/python3.5/distutils/ccompiler.py", line 574, in compile
07-Feb-2019 14:42:58       self._compile(obj, src, ext, cc_args, extra_postargs, pp_opts)
07-Feb-2019 14:42:58     File "/usr/lib/python3.5/distutils/unixccompiler.py", line 120, in _compile
07-Feb-2019 14:42:58       raise CompileError(msg)
07-Feb-2019 14:42:58   distutils.errors.CompileError: command 'x86_64-linux-gnu-gcc' failed with exit status 1
07-Feb-2019 14:42:58  
07-Feb-2019 14:42:58   During handling of the above exception, another exception occurred:
07-Feb-2019 14:42:58  
07-Feb-2019 14:42:58   Traceback (most recent call last):
07-Feb-2019 14:42:58     File "/usr/lib/python3/dist-packages/setuptools/sandbox.py", line 154, in save_modules
07-Feb-2019 14:42:58       yield saved
07-Feb-2019 14:42:58     File "/usr/lib/python3/dist-packages/setuptools/sandbox.py", line 195, in setup_context
07-Feb-2019 14:42:58       yield
07-Feb-2019 14:42:58     File "/usr/lib/python3/dist-packages/setuptools/sandbox.py", line 243, in run_setup
07-Feb-2019 14:42:58       DirectorySandbox(setup_dir).run(runner)
07-Feb-2019 14:42:58     File "/usr/lib/python3/dist-packages/setuptools/sandbox.py", line 273, in run
07-Feb-2019 14:42:58       return func()
07-Feb-2019 14:42:58     File "/usr/lib/python3/dist-packages/setuptools/sandbox.py", line 242, in runner
07-Feb-2019 14:42:58       _execfile(setup_script, ns)
07-Feb-2019 14:42:58     File "/usr/lib/python3/dist-packages/setuptools/sandbox.py", line 46, in _execfile
07-Feb-2019 14:42:58       exec(code, globals, locals)
07-Feb-2019 14:42:58     File "/tmp/easy_install-aq51s6qh/cffi-1.11.5/setup.py", line 240, in <module>
07-Feb-2019 14:42:58       **keywords_with_side_effects(sys.argv)
07-Feb-2019 14:42:58     File "/usr/lib/python3.5/distutils/core.py", line 163, in setup
07-Feb-2019 14:42:58       raise SystemExit("error: " + str(msg))
07-Feb-2019 14:42:58   SystemExit: error: command 'x86_64-linux-gnu-gcc' failed with exit status 1
07-Feb-2019 14:42:58  
07-Feb-2019 14:42:58   During handling of the above exception, another exception occurred:
07-Feb-2019 14:42:58  
07-Feb-2019 14:42:58   Traceback (most recent call last):
07-Feb-2019 14:42:58     File "/usr/lib/python3/dist-packages/setuptools/command/easy_install.py", line 1087, in run_setup
07-Feb-2019 14:42:58       run_setup(setup_script, args)
07-Feb-2019 14:42:58     File "/usr/lib/python3/dist-packages/setuptools/sandbox.py", line 246, in run_setup
07-Feb-2019 14:42:58       raise
07-Feb-2019 14:42:58     File "/usr/lib/python3.5/contextlib.py", line 77, in __exit__
07-Feb-2019 14:42:58       self.gen.throw(type, value, traceback)
07-Feb-2019 14:42:58     File "/usr/lib/python3/dist-packages/setuptools/sandbox.py", line 195, in setup_context
07-Feb-2019 14:42:58       yield
07-Feb-2019 14:42:58     File "/usr/lib/python3.5/contextlib.py", line 77, in __exit__
07-Feb-2019 14:42:58       self.gen.throw(type, value, traceback)
07-Feb-2019 14:42:58     File "/usr/lib/python3/dist-packages/setuptools/sandbox.py", line 166, in save_modules
07-Feb-2019 14:42:58       saved_exc.resume()
07-Feb-2019 14:42:58     File "/usr/lib/python3/dist-packages/setuptools/sandbox.py", line 141, in resume
07-Feb-2019 14:42:58       six.reraise(type, exc, self._tb)
07-Feb-2019 14:42:58     File "/usr/lib/python3/dist-packages/pkg_resources/_vendor/six.py", line 685, in reraise
07-Feb-2019 14:42:58       raise value.with_traceback(tb)
07-Feb-2019 14:42:58     File "/usr/lib/python3/dist-packages/setuptools/sandbox.py", line 154, in save_modules
07-Feb-2019 14:42:58       yield saved
07-Feb-2019 14:42:58     File "/usr/lib/python3/dist-packages/setuptools/sandbox.py", line 195, in setup_context
07-Feb-2019 14:42:58       yield
07-Feb-2019 14:42:58     File "/usr/lib/python3/dist-packages/setuptools/sandbox.py", line 243, in run_setup
07-Feb-2019 14:42:58       DirectorySandbox(setup_dir).run(runner)
07-Feb-2019 14:42:58     File "/usr/lib/python3/dist-packages/setuptools/sandbox.py", line 273, in run
07-Feb-2019 14:42:58       return func()
07-Feb-2019 14:42:58     File "/usr/lib/python3/dist-packages/setuptools/sandbox.py", line 242, in runner
07-Feb-2019 14:42:58       _execfile(setup_script, ns)
07-Feb-2019 14:42:58     File "/usr/lib/python3/dist-packages/setuptools/sandbox.py", line 46, in _execfile
07-Feb-2019 14:42:58       exec(code, globals, locals)
07-Feb-2019 14:42:58     File "/tmp/easy_install-aq51s6qh/cffi-1.11.5/setup.py", line 240, in <module>
07-Feb-2019 14:42:58       **keywords_with_side_effects(sys.argv)
07-Feb-2019 14:42:58     File "/usr/lib/python3.5/distutils/core.py", line 163, in setup
07-Feb-2019 14:42:58       raise SystemExit("error: " + str(msg))
07-Feb-2019 14:42:58   SystemExit: error: command 'x86_64-linux-gnu-gcc' failed with exit status 1
07-Feb-2019 14:42:58  
07-Feb-2019 14:42:58   During handling of the above exception, another exception occurred:
07-Feb-2019 14:42:58  
07-Feb-2019 14:42:58   Traceback (most recent call last):
07-Feb-2019 14:42:58     File "<string>", line 1, in <module>
07-Feb-2019 14:42:58     File "/tmp/pip-build-wqoivmad/bcrypt/setup.py", line 240, in <module>
07-Feb-2019 14:42:58       **keywords_with_side_effects(sys.argv)
07-Feb-2019 14:42:58     File "/usr/lib/python3.5/distutils/core.py", line 108, in setup
07-Feb-2019 14:42:58       _setup_distribution = dist = klass(attrs)
07-Feb-2019 14:42:58     File "/usr/lib/python3/dist-packages/setuptools/dist.py", line 269, in __init__
07-Feb-2019 14:42:58       self.fetch_build_eggs(attrs['setup_requires'])
07-Feb-2019 14:42:58     File "/usr/lib/python3/dist-packages/setuptools/dist.py", line 313, in fetch_build_eggs
07-Feb-2019 14:42:58       replace_conflicting=True,
07-Feb-2019 14:42:58     File "/usr/lib/python3/dist-packages/pkg_resources/__init__.py", line 826, in resolve
07-Feb-2019 14:42:58       dist = best[req.key] = env.best_match(req, ws, installer)
07-Feb-2019 14:42:58     File "/usr/lib/python3/dist-packages/pkg_resources/__init__.py", line 1092, in best_match
07-Feb-2019 14:42:58       return self.obtain(req, installer)
07-Feb-2019 14:42:58     File "/usr/lib/python3/dist-packages/pkg_resources/__init__.py", line 1104, in obtain
07-Feb-2019 14:42:58       return installer(requirement)
07-Feb-2019 14:42:58     File "/usr/lib/python3/dist-packages/setuptools/dist.py", line 380, in fetch_build_egg
07-Feb-2019 14:42:58       return cmd.easy_install(req)
07-Feb-2019 14:42:58     File "/usr/lib/python3/dist-packages/setuptools/command/easy_install.py", line 663, in easy_install
07-Feb-2019 14:42:58       return self.install_item(spec, dist.location, tmpdir, deps)
07-Feb-2019 14:42:58     File "/usr/lib/python3/dist-packages/setuptools/command/easy_install.py", line 693, in install_item
07-Feb-2019 14:42:58       dists = self.install_eggs(spec, download, tmpdir)
07-Feb-2019 14:42:58     File "/usr/lib/python3/dist-packages/setuptools/command/easy_install.py", line 873, in install_eggs
07-Feb-2019 14:42:58       return self.build_and_install(setup_script, setup_base)
07-Feb-2019 14:42:58     File "/usr/lib/python3/dist-packages/setuptools/command/easy_install.py", line 1101, in build_and_install
07-Feb-2019 14:42:58       self.run_setup(setup_script, setup_base, args)
07-Feb-2019 14:42:58     File "/usr/lib/python3/dist-packages/setuptools/command/easy_install.py", line 1089, in run_setup
07-Feb-2019 14:42:58       raise DistutilsError("Setup script exited with %s" % (v.args[0],))
07-Feb-2019 14:42:58   distutils.errors.DistutilsError: Setup script exited with error: command 'x86_64-linux-gnu-gcc' failed with exit status 1
07-Feb-2019 14:42:58  
07-Feb-2019 14:42:58   ----------------------------------------
07-Feb-2019 14:42:58   Failed cleaning build dir for bcrypt
07-Feb-2019 14:42:58   Running setup.py bdist_wheel for pycparser: started
07-Feb-2019 14:42:59   Running setup.py bdist_wheel for pycparser: finished with status 'done'
07-Feb-2019 14:42:59   Stored in directory: /root/.cache/pip/wheels/f2/9a/90/de94f8556265ddc9d9c8b271b0f63e57b26fb1d67a45564511
07-Feb-2019 14:42:59 Successfully built pycparser
07-Feb-2019 14:42:59 Failed to build bcrypt
07-Feb-2019 14:42:59 Installing collected packages: passlib, pycparser, cffi, six, bcrypt
07-Feb-2019 14:42:59   Running setup.py install for bcrypt: started
07-Feb-2019 14:43:00     Running setup.py install for bcrypt: finished with status 'done'
07-Feb-2019 14:43:00 Successfully installed bcrypt-3.1.6 cffi-1.11.5 passlib-1.7.1 pycparser-2.19 six-1.12.0
07-Feb-2019 14:43:01 You are using pip version 8.1.1, however version 19.0.1 is available.
07-Feb-2019 14:43:01 You should consider upgrading via the 'pip install --upgrade pip' command.
07-Feb-2019 14:43:09 Removing intermediate container f7506b67901a
07-Feb-2019 14:43:09 ---> b0ee62ea0b85
07-Feb-2019 14:43:09 Step 5/6 : COPY FILES.mongo-init /
07-Feb-2019 14:43:09 ---> c113a0d368b4
07-Feb-2019 14:43:09 Step 6/6 : ENTRYPOINT ["/usr/local/bin/entrypoint.sh"]
07-Feb-2019 14:43:09 ---> Running in d6ba26151a5e
07-Feb-2019 14:43:09 Removing intermediate container d6ba26151a5e
07-Feb-2019 14:43:09 ---> fb4da35225f9
07-Feb-2019 14:43:09 Successfully built fb4da35225f9
07-Feb-2019 14:43:09 Successfully tagged clowder/mongo-init:latest
07-Feb-2019 14:43:09 Finished task 'docker build' with result: Success
07-Feb-2019 14:43:09 Starting task 'docker push' of type 'com.atlassian.bamboo.plugins.scripttask:task.builder.script'
07-Feb-2019 14:43:09
Beginning to execute external process for build 'Clowder - CORE - hotfix-CATS-802-fix-swagger.yml - default #1 (CATS-CORE968-JOB1-1)'
... running command line:
/bin/sh release.sh
... in: /home/bamboo/bamboo-agent-home/xml-data/build-dir/CATS-CORE968-JOB1
... using extra environment variables:
bamboo_planRepository_1_branch=hotfix/CATS-802-fix-swagger.yml
bamboo_capability_system_builder_command_npm_6=/home/bamboo/node-v6.9.1/bin/npm
bamboo_capability_system_builder_command_buckminster_4_3=/home/bamboo/buckminster-4.3/buckminster
bamboo_capability_system_builder_node_Node_js_v6_9_1=/home/bamboo/node-v6.9.1/bin/node
bamboo_capability_system_builder_command_buckminster_4_4=/home/bamboo/buckminster-4.4/buckminster
bamboo_repository_166953024_branch_name=hotfix/CATS-802-fix-swagger.yml
bamboo_capability_system_builder_command_buckminster_4_2=/home/bamboo/buckminster-4.2/buckminster
bamboo_planRepository_1_branchDisplayName=hotfix/CATS-802-fix-swagger.yml
bamboo_repository_revision_number=f0977578d2d168fa3009923756fd298c335d3e44
bamboo_repository_166953024_revision_number=f0977578d2d168fa3009923756fd298c335d3e44
bamboo_resultsUrl=https://opensource.ncsa.illinois.edu/bamboo/browse/CATS-CORE968-JOB1-1
bamboo_build_commandline_com_atlassian_bamboo_plugins_scripttask_task_builder_script_15=/bin/sh /home/bamboo/bamboo-agent-home/temp/CATS-CORE968-JOB1-1-ScriptBuildTask-4354549431804205467.sh
bamboo_build_commandline_com_atlassian_bamboo_plugins_scripttask_task_builder_script_16=/bin/sh docker.sh
bamboo_capability_system_builder_command_sphinx=/usr/bin/sphinx-build
bamboo_build_working_directory=/home/bamboo/bamboo-agent-home/xml-data/build-dir/CATS-CORE968-JOB1
bamboo_planRepository_1_name=clowder
bamboo_buildKey=CATS-CORE968-JOB1
bamboo_repository_166953024_previous_revision_number=f0977578d2d168fa3009923756fd298c335d3e44
bamboo_capability_system_os=linux
bamboo_shortPlanName=hotfix-CATS-802-fix-swagger.yml
bamboo_planRepository_name=clowder
bamboo_buildNumber=1
bamboo_capability_system_builder_node_grunt_6=/home/bamboo/node-v6.9.1/bin/grunt
bamboo_shortJobName=default
bamboo_buildResultsUrl=https://opensource.ncsa.illinois.edu/bamboo/browse/CATS-CORE968-JOB1-1
bamboo_planRepository_repositoryUrl=ssh://git@opensource.ncsa.illinois.edu:7999/cats/clowder.git
bamboo_build_commandline_com_atlassian_bamboo_plugins_sbt_sbt_18=/home/bamboo/sbt-0.13.13/bin/sbt compile
bamboo_build_commandline_com_atlassian_bamboo_plugins_sbt_sbt_19=/home/bamboo/sbt-0.13.13/bin/sbt test-only integration.APITestSuite
bamboo_build_commandline_com_atlassian_bamboo_plugins_scripttask_task_builder_script_22=/home/bamboo/bamboo-agent-home/temp/CATS-CORE968-JOB1-1-ScriptBuildTask-4159374577854222380.sh
bamboo_agentId=143032321
bamboo_build_commandline_com_atlassian_bamboo_plugins_sbt_sbt_17=/home/bamboo/sbt-0.13.13/bin/sbt clean update
bamboo_planName=Clowder - CORE - hotfix-CATS-802-fix-swagger.yml
bamboo_shortPlanKey=CORE968
bamboo_capability_system_builder_command_sbt_0_13=/home/bamboo/sbt-0.13.2/bin/sbt
bamboo_capability_system_builder_node_Node_js_v0_10_28=/home/bamboo/node-v0.10.28/bin/node
bamboo_shortJobKey=JOB1
bamboo_planRepository_revision=f0977578d2d168fa3009923756fd298c335d3e44
bamboo_repository_previous_revision_number=f0977578d2d168fa3009923756fd298c335d3e44
bamboo_buildTimeStamp=2019-02-07T14:21:52.013-06:00
bamboo_capability_system_builder_command_npm=/home/bamboo/node-v0.10.28/bin/npm
bamboo_capability_system_builder_mvn2_Maven_2=/home/bamboo/apache-maven-2.2.1
bamboo_planRepository_previousRevision=f0977578d2d168fa3009923756fd298c335d3e44
bamboo_repository_166953024_name=clowder
bamboo_repository_git_branch=hotfix/CATS-802-fix-swagger.yml
bamboo_buildResultKey=CATS-CORE968-JOB1-1
bamboo_repository_branch_name=hotfix/CATS-802-fix-swagger.yml
bamboo_buildPlanName=Clowder - CORE - hotfix-CATS-802-fix-swagger.yml - default
bamboo_planRepository_1_revision=f0977578d2d168fa3009923756fd298c335d3e44
bamboo_capability_system_builder_command_python3=/usr/bin/python3
bamboo_repository_name=clowder
bamboo_build_commandline_com_atlassian_bamboo_plugins_sbt_sbt_21=/home/bamboo/sbt-0.13.13/bin/sbt dist
bamboo_buildFailed=false
bamboo_build_commandline_com_atlassian_bamboo_plugins_sbt_sbt_20=/home/bamboo/sbt-0.13.13/bin/sbt doc
bamboo_capability_system_docker_executable=/usr/bin/docker
bamboo_capability_system_builder_command_grunt=/home/bamboo/node-v0.10.28/bin/grunt
bamboo_repository_166953024_git_username=
bamboo_planRepository_branch=hotfix/CATS-802-fix-swagger.yml
bamboo_agentWorkingDirectory=/home/bamboo/bamboo-agent-home/xml-data/build-dir
bamboo_capability_system_git_executable=/usr/bin/git
bamboo_repository_git_username=
bamboo_planRepository_1_previousRevision=f0977578d2d168fa3009923756fd298c335d3e44
bamboo_capability_system_builder_sbt_SBT_0_13_13=/home/bamboo/sbt-0.13.13
bamboo_planRepository_branchDisplayName=hotfix/CATS-802-fix-swagger.yml
bamboo_repository_166953024_git_branch=hotfix/CATS-802-fix-swagger.yml
bamboo_capability_system_builder_command_phantomjs=/home/bamboo/phantomjs-1.9.8/bin/phantomjs
bamboo_planRepository_1_type=bbserver
bamboo_planRepository_branchName=hotfix/CATS-802-fix-swagger.yml
bamboo_capability_system_builder_command_python2_7=/usr/bin/python2.7
bamboo_capability_system_hostname=buildserver-1
bamboo_capability_system_jdk_JDK=/home/bamboo/jdk1.8.0_66
bamboo_capability_system_software_mongo=/usr/bin/mongo
bamboo_repository_166953024_git_repositoryUrl=ssh://git@opensource.ncsa.illinois.edu:7999/cats/clowder.git
bamboo_plan_storageTag=plan-166756479
bamboo_hg_cache_directory=/home/bamboo/bamboo-agent-home/xml-data/build-dir/_hg-repositories-cache
bamboo_capability_system_builder_command_casperjs=/home/bamboo/node-v0.10.28/bin/casperjs
bamboo_capability_system_software_rabbitmq=/usr/sbin/rabbitmqctl
bamboo_capability_system_jdk_JDK_1_8_0_66=/home/bamboo/jdk1.8.0_66
bamboo_planRepository_1_username=
bamboo_planRepository_type=bbserver
bamboo_git_cache_directory=/home/bamboo/bamboo-agent-home/xml-data/build-dir/_git-repositories-cache
bamboo_repository_git_repositoryUrl=ssh://git@opensource.ncsa.illinois.edu:7999/cats/clowder.git
bamboo_capability_system_builder_node_Node_js=/home/bamboo/node-v0.10.28/bin/node
bamboo_capability_system_builder_ant_Ant=/home/bamboo/apache-ant-1.9.4
bamboo_capability_system_builder_mvn3_Maven_3=/home/bamboo/apache-maven-3.3.9
bamboo_tmp_directory=/home/bamboo/bamboo-agent-home/temp
bamboo_working_directory=/home/bamboo/bamboo-agent-home/xml-data/build-dir/CATS-CORE968-JOB1
bamboo_planKey=CATS-CORE968
bamboo_planRepository_1_repositoryUrl=ssh://git@opensource.ncsa.illinois.edu:7999/cats/clowder.git
bamboo_planRepository_username=
bamboo_capability_system_jdk_JDK_1_8=/home/bamboo/jdk1.8.0_66
bamboo_capability_system_jdk_JDK_1_6=/home/bamboo/jdk1.6.0_41
bamboo_capability_system_builder_command_mkcrx=/home/bamboo/mkcrx/mkcrx.sh
bamboo_capability_system_jdk_JDK_1_7=/home/bamboo/jdk1.7.0_60
bamboo_planRepository_1_branchName=hotfix/CATS-802-fix-swagger.yml
07-Feb-2019 14:43:10 Sending build context to Docker daemon  75.38MB
07-Feb-2019 14:43:10
07-Feb-2019 14:43:10 Step 1/20 : FROM java:jdk-alpine as clowder-build
07-Feb-2019 14:43:10 ---> 3fd9dd82815c
07-Feb-2019 14:43:10 Step 2/20 : WORKDIR /src
07-Feb-2019 14:43:10 ---> Using cache
07-Feb-2019 14:43:10 ---> 8d0a00f6c844
07-Feb-2019 14:43:10 Step 3/20 : COPY sbt* /src/
07-Feb-2019 14:43:10 ---> Using cache
07-Feb-2019 14:43:10 ---> cdf3ae8b02e6
07-Feb-2019 14:43:10 Step 4/20 : COPY project /src/project
07-Feb-2019 14:43:10 ---> Using cache
07-Feb-2019 14:43:10 ---> 08cecc0a3a01
07-Feb-2019 14:43:10 Step 5/20 : RUN ./sbt update
07-Feb-2019 14:43:10 ---> Using cache
07-Feb-2019 14:43:10 ---> 0ba5d59d7d70
07-Feb-2019 14:43:10 Step 6/20 : COPY lib /src/lib/
07-Feb-2019 14:43:10 ---> Using cache
07-Feb-2019 14:43:10 ---> 97f9a5a1ec5f
07-Feb-2019 14:43:10 Step 7/20 : COPY conf /src/conf/
07-Feb-2019 14:43:10 ---> Using cache
07-Feb-2019 14:43:10 ---> 3234ef831cc0
07-Feb-2019 14:43:10 Step 8/20 : COPY public /src/public/
07-Feb-2019 14:43:10 ---> Using cache
07-Feb-2019 14:43:10 ---> 1793deee8109
07-Feb-2019 14:43:10 Step 9/20 : COPY app /src/app/
07-Feb-2019 14:43:10 ---> Using cache
07-Feb-2019 14:43:10 ---> e5c2510826c2
07-Feb-2019 14:43:10 Step 10/20 : RUN ./sbt dist     && unzip -q target/universal/clowder-*.zip     && mv clowder-* clowder     && mkdir -p clowder/custom clowder/logs
07-Feb-2019 14:43:10 ---> Using cache
07-Feb-2019 14:43:10 ---> 5fc1f2f4b1da
07-Feb-2019 14:43:10 Step 11/20 : FROM java:jre-alpine
07-Feb-2019 14:43:10 ---> fdc893b19a14
07-Feb-2019 14:43:10 Step 12/20 : RUN apk add --no-cache bash curl
07-Feb-2019 14:43:10 ---> Using cache
07-Feb-2019 14:43:10 ---> f47a674396f0
07-Feb-2019 14:43:10 Step 13/20 : EXPOSE 9000
07-Feb-2019 14:43:10 ---> Using cache
07-Feb-2019 14:43:10 ---> d7290c8c65c1
07-Feb-2019 14:43:10 Step 14/20 : WORKDIR /home/clowder
07-Feb-2019 14:43:10 ---> Using cache
07-Feb-2019 14:43:10 ---> b827bb39214e
07-Feb-2019 14:43:10 Step 15/20 : VOLUME /home/clowder/custom /home/clowder/data
07-Feb-2019 14:43:10 ---> Using cache
07-Feb-2019 14:43:10 ---> db4ea1c1aa4f
07-Feb-2019 14:43:10 Step 16/20 : COPY --from=clowder-build /src/clowder /home/clowder/
07-Feb-2019 14:43:10 ---> Using cache
07-Feb-2019 14:43:10 ---> 91640bc28e93
07-Feb-2019 14:43:10 Step 17/20 : COPY docker/clowder.sh docker/healthcheck.sh /home/clowder/
07-Feb-2019 14:43:10 ---> Using cache
07-Feb-2019 14:43:10 ---> ce776372f8e6
07-Feb-2019 14:43:10 Step 18/20 : COPY docker/custom.conf docker/play.plugins /home/clowder/custom/
07-Feb-2019 14:43:10 ---> Using cache
07-Feb-2019 14:43:10 ---> d98371ee29a8
07-Feb-2019 14:43:10 Step 19/20 : CMD /home/clowder/clowder.sh
07-Feb-2019 14:43:10 ---> Using cache
07-Feb-2019 14:43:10 ---> 5d6e53c2650b
07-Feb-2019 14:43:10 Step 20/20 : HEALTHCHECK CMD /home/clowder/healthcheck.sh
07-Feb-2019 14:43:10 ---> Using cache
07-Feb-2019 14:43:10 ---> a26287e1a476
07-Feb-2019 14:43:10 Successfully built a26287e1a476
07-Feb-2019 14:43:11 Successfully tagged clowder/clowder:latest
07-Feb-2019 14:43:11 Sending build context to Docker daemon  22.02kB
07-Feb-2019 14:43:11
07-Feb-2019 14:43:11 Step 1/5 : FROM ubuntu
07-Feb-2019 14:43:11 ---> 47b19964fb50
07-Feb-2019 14:43:11 Step 2/5 : RUN apt-get -y update     && apt-get -y install curl unzip docker.io python python-dev python-pip     && pip install flask-restful     && pip install arrow     && apt-get clean all     && rm -rf /var/lib/apt/lists/* /tmp/* /var/tmp/*     ;
07-Feb-2019 14:43:11 ---> Using cache
07-Feb-2019 14:43:11 ---> f6ffe2884f02
07-Feb-2019 14:43:11 Step 3/5 : COPY FILES.toolserver /
07-Feb-2019 14:43:11 ---> Using cache
07-Feb-2019 14:43:11 ---> 5722df67305c
07-Feb-2019 14:43:11 Step 4/5 : ENV TOOLSERVER_PORT 8082
07-Feb-2019 14:43:11 ---> Using cache
07-Feb-2019 14:43:11 ---> 6940b1f6c17c
07-Feb-2019 14:43:11 Step 5/5 : CMD /usr/local/bin/usage
07-Feb-2019 14:43:11 ---> Using cache
07-Feb-2019 14:43:11 ---> 714eed318567
07-Feb-2019 14:43:11 Successfully built 714eed318567
07-Feb-2019 14:43:11 Successfully tagged clowder/toolserver:latest
07-Feb-2019 14:43:11 Sending build context to Docker daemon  11.26kB
07-Feb-2019 14:43:11
07-Feb-2019 14:43:11 Step 1/6 : FROM ubuntu:16.04
07-Feb-2019 14:43:11 ---> 7e87e2b3bf7a
07-Feb-2019 14:43:11 Step 2/6 : MAINTAINER Bing Zhang <bing@illinois.edu>
07-Feb-2019 14:43:11 ---> Using cache
07-Feb-2019 14:43:11 ---> 828e1228ed37
07-Feb-2019 14:43:11 Step 3/6 : ENV EMAIL_ADDRESS=""    FIRST_NAME=""    LAST_NAME=""     PASSWORD=""    MONGO_URI=""    CLOWDER_PORT_9000_TCP_ADDR=""    CLOWDER_PORT_9000_TCP_PORT=""    RABBITMQ_PORT_15672_TCP_ADDR=""    RABBITMQ_PORT_15672_PORT=""    MONGO_PORT_27017_TCP_ADDR=""    MONGO_PORT_27017_TCP_PORT=""
07-Feb-2019 14:43:11 ---> Using cache
07-Feb-2019 14:43:11 ---> 0563eb93db4b
07-Feb-2019 14:43:11 Step 4/6 : RUN mkdir -p /data/db &&     apt-get update &&     apt-get install -y netcat curl lsb-release &&     apt-key adv --keyserver hkp://keyserver.ubuntu.com:80 --recv EA312927 &&     echo "deb http://repo.mongodb.org/apt/ubuntu "$(lsb_release -sc)"/mongodb-org/3.2 multiverse" | tee /etc/apt/sources.list.d/mongodb-org-3.2.list &&     apt-get update && apt-get install -y     mongodb-org     net-tools iproute     python3 python3-pip &&     pip3 install passlib bcrypt
07-Feb-2019 14:43:11 ---> Using cache
07-Feb-2019 14:43:11 ---> b0ee62ea0b85
07-Feb-2019 14:43:11 Step 5/6 : COPY FILES.mongo-init /
07-Feb-2019 14:43:11 ---> Using cache
07-Feb-2019 14:43:11 ---> c113a0d368b4
07-Feb-2019 14:43:11 Step 6/6 : ENTRYPOINT ["/usr/local/bin/entrypoint.sh"]
07-Feb-2019 14:43:11 ---> Using cache
07-Feb-2019 14:43:11 ---> fb4da35225f9
07-Feb-2019 14:43:11 Successfully built fb4da35225f9
07-Feb-2019 14:43:11 Successfully tagged clowder/mongo-init:latest
07-Feb-2019 14:43:11 Finished task 'docker push' with result: Success
07-Feb-2019 14:43:11 Running post build plugin 'Docker Container Cleanup'
07-Feb-2019 14:43:11 Running post build plugin 'NCover Results Collector'
07-Feb-2019 14:43:11 Running post build plugin 'Clover Results Collector'
07-Feb-2019 14:43:11 Running post build plugin 'npm Cache Cleanup'
07-Feb-2019 14:43:11 Running post build plugin 'Artifact Copier'
07-Feb-2019 14:43:11 Publishing an artifact: dist
07-Feb-2019 14:43:20 Finished publishing of artifact Non required shared artifact: [dist], pattern: [clowder-*.zip] anchored at: [target/universal] in 8.774 s
07-Feb-2019 14:43:20 Publishing an artifact: scaladoc
07-Feb-2019 14:43:22 Finished publishing of artifact Non required shared artifact: [scaladoc], pattern: [**/*] anchored at: [target/scala-2.10/api] in 1.807 s
07-Feb-2019 14:43:22 Publishing an artifact: manual
07-Feb-2019 14:43:24 Finished publishing of artifact Non required shared artifact: [manual], pattern: [**/*] anchored at: [doc/src/sphinx/_build/html] in 1.937 s
07-Feb-2019 14:43:24 Finalising the build...
07-Feb-2019 14:43:24 Stopping timer.
07-Feb-2019 14:43:24 Build CATS-CORE968-JOB1-1 completed.
07-Feb-2019 14:43:27 Running on server: post build plugin 'NCover Results Collector'
07-Feb-2019 14:43:28 Running on server: post build plugin 'Build Hanging Detection Configuration'
07-Feb-2019 14:43:28 Running on server: post build plugin 'Clover Delta Calculator'
07-Feb-2019 14:43:28 Running on server: post build plugin 'Maven Dependencies Postprocessor'
07-Feb-2019 14:43:28 All post build plugins have finished
07-Feb-2019 14:43:28 Generating build results summary...
07-Feb-2019 14:43:28 Saving build results to disk...
07-Feb-2019 14:43:28 Logging substituted variables...
07-Feb-2019 14:43:28 Indexing build results...
07-Feb-2019 14:43:28 Finished building CATS-CORE968-JOB1-1.