Build: #3 was successful

Job: default was successful

Stages & jobs

  1. Default Stage

Build log

The build generated 7,415 lines of output.The output is too long and has been truncated to the last 1,000 lines. Download or view full build log.

19-Feb-2019 16:42:58 Selecting previously unselected package netcat.
19-Feb-2019 16:42:58 Preparing to unpack .../netcat_1.10-41_all.deb ...
19-Feb-2019 16:42:58 Unpacking netcat (1.10-41) ...
19-Feb-2019 16:42:58 Processing triggers for libc-bin (2.23-0ubuntu10) ...
19-Feb-2019 16:42:59 Setting up mime-support (3.59ubuntu1) ...
19-Feb-2019 16:42:59 Setting up libmpdec2:amd64 (2.4.2-1) ...
19-Feb-2019 16:43:00 Setting up libsqlite3-0:amd64 (3.11.0-1ubuntu1) ...
19-Feb-2019 16:43:00 Setting up libpython3.5-stdlib:amd64 (3.5.2-2ubuntu0~16.04.5) ...
19-Feb-2019 16:43:00 Setting up python3.5 (3.5.2-2ubuntu0~16.04.5) ...
19-Feb-2019 16:43:02 Setting up libpython3-stdlib:amd64 (3.5.1-3) ...
19-Feb-2019 16:43:02 Setting up distro-info-data (0.28ubuntu0.9) ...
19-Feb-2019 16:43:02 Setting up libmagic1:amd64 (1:5.25-2ubuntu1.1) ...
19-Feb-2019 16:43:03 Setting up file (1:5.25-2ubuntu1.1) ...
19-Feb-2019 16:43:04 Setting up libffi6:amd64 (3.2.1-4) ...
19-Feb-2019 16:43:04 Setting up libgmp10:amd64 (2:6.1.0+dfsg-2) ...
19-Feb-2019 16:43:04 Setting up libnettle6:amd64 (3.2-1ubuntu0.16.04.1) ...
19-Feb-2019 16:43:04 Setting up libhogweed4:amd64 (3.2-1ubuntu0.16.04.1) ...
19-Feb-2019 16:43:05 Setting up libidn11:amd64 (1.32-3ubuntu1.2) ...
19-Feb-2019 16:43:05 Setting up libp11-kit0:amd64 (0.23.2-5~ubuntu16.04.1) ...
19-Feb-2019 16:43:05 Setting up libtasn1-6:amd64 (4.7-3ubuntu0.16.04.3) ...
19-Feb-2019 16:43:05 Setting up libgnutls30:amd64 (3.4.10-4ubuntu1.4) ...
19-Feb-2019 16:43:06 Setting up openssl (1.0.2g-1ubuntu4.14) ...
19-Feb-2019 16:43:06 Setting up ca-certificates (20170717~16.04.2) ...
19-Feb-2019 16:43:06 debconf: unable to initialize frontend: Dialog
19-Feb-2019 16:43:06 debconf: (TERM is not set, so the dialog frontend is not usable.)
19-Feb-2019 16:43:06 debconf: falling back to frontend: Readline
19-Feb-2019 16:43:06 debconf: unable to initialize frontend: Readline
19-Feb-2019 16:43:06 debconf: (Can't locate Term/ReadLine.pm in @INC (you may need to install the Term::ReadLine module) (@INC contains: /etc/perl /usr/local/lib/x86_64-linux-gnu/perl/5.22.1 /usr/local/share/perl/5.22.1 /usr/lib/x86_64-linux-gnu/perl5/5.22 /usr/share/perl5 /usr/lib/x86_64-linux-gnu/perl/5.22 /usr/share/perl/5.22 /usr/local/lib/site_perl /usr/lib/x86_64-linux-gnu/perl-base .) at /usr/share/perl5/Debconf/FrontEnd/Readline.pm line 7.)
19-Feb-2019 16:43:06 debconf: falling back to frontend: Teletype
19-Feb-2019 16:43:07 Setting up krb5-locales (1.13.2+dfsg-5ubuntu2.1) ...
19-Feb-2019 16:43:07 Setting up libroken18-heimdal:amd64 (1.7~git20150920+dfsg-4ubuntu1.16.04.1) ...
19-Feb-2019 16:43:07 Setting up libasn1-8-heimdal:amd64 (1.7~git20150920+dfsg-4ubuntu1.16.04.1) ...
19-Feb-2019 16:43:08 Setting up libkrb5support0:amd64 (1.13.2+dfsg-5ubuntu2.1) ...
19-Feb-2019 16:43:08 Setting up libk5crypto3:amd64 (1.13.2+dfsg-5ubuntu2.1) ...
19-Feb-2019 16:43:08 Setting up libkeyutils1:amd64 (1.5.9-8ubuntu1) ...
19-Feb-2019 16:43:09 Setting up libkrb5-3:amd64 (1.13.2+dfsg-5ubuntu2.1) ...
19-Feb-2019 16:43:09 Setting up libgssapi-krb5-2:amd64 (1.13.2+dfsg-5ubuntu2.1) ...
19-Feb-2019 16:43:09 Setting up libhcrypto4-heimdal:amd64 (1.7~git20150920+dfsg-4ubuntu1.16.04.1) ...
19-Feb-2019 16:43:09 Setting up libheimbase1-heimdal:amd64 (1.7~git20150920+dfsg-4ubuntu1.16.04.1) ...
19-Feb-2019 16:43:09 Setting up libwind0-heimdal:amd64 (1.7~git20150920+dfsg-4ubuntu1.16.04.1) ...
19-Feb-2019 16:43:09 Setting up libhx509-5-heimdal:amd64 (1.7~git20150920+dfsg-4ubuntu1.16.04.1) ...
19-Feb-2019 16:43:09 Setting up libkrb5-26-heimdal:amd64 (1.7~git20150920+dfsg-4ubuntu1.16.04.1) ...
19-Feb-2019 16:43:10 Setting up libheimntlm0-heimdal:amd64 (1.7~git20150920+dfsg-4ubuntu1.16.04.1) ...
19-Feb-2019 16:43:10 Setting up libgssapi3-heimdal:amd64 (1.7~git20150920+dfsg-4ubuntu1.16.04.1) ...
19-Feb-2019 16:43:10 Setting up libsasl2-modules-db:amd64 (2.1.26.dfsg1-14ubuntu0.1) ...
19-Feb-2019 16:43:10 Setting up libsasl2-2:amd64 (2.1.26.dfsg1-14ubuntu0.1) ...
19-Feb-2019 16:43:10 Setting up libldap-2.4-2:amd64 (2.4.42+dfsg-2ubuntu3.4) ...
19-Feb-2019 16:43:10 Setting up librtmp1:amd64 (2.4+20151223.gitfa8646d-1ubuntu0.1) ...
19-Feb-2019 16:43:11 Setting up libcurl3-gnutls:amd64 (7.47.0-1ubuntu2.12) ...
19-Feb-2019 16:43:11 Setting up libsasl2-modules:amd64 (2.1.26.dfsg1-14ubuntu0.1) ...
19-Feb-2019 16:43:11 Setting up curl (7.47.0-1ubuntu2.12) ...
19-Feb-2019 16:43:11 Setting up netcat-traditional (1.10-41) ...
19-Feb-2019 16:43:11 update-alternatives: using /bin/nc.traditional to provide /bin/nc (nc) in auto mode
19-Feb-2019 16:43:11 Setting up netcat (1.10-41) ...
19-Feb-2019 16:43:11 Setting up python3 (3.5.1-3) ...
19-Feb-2019 16:43:11 running python rtupdate hooks for python3.5...
19-Feb-2019 16:43:12 running python post-rtupdate hooks for python3.5...
19-Feb-2019 16:43:12 Setting up lsb-release (9.20160110ubuntu0.2) ...
19-Feb-2019 16:43:12 Setting up dh-python (2.20151103ubuntu1.1) ...
19-Feb-2019 16:43:12 Processing triggers for libc-bin (2.23-0ubuntu10) ...
19-Feb-2019 16:43:12 Processing triggers for ca-certificates (20170717~16.04.2) ...
19-Feb-2019 16:43:12 Updating certificates in /etc/ssl/certs...
19-Feb-2019 16:43:14 148 added, 0 removed; done.
19-Feb-2019 16:43:14 Running hooks in /etc/ca-certificates/update.d...
19-Feb-2019 16:43:14 done.
19-Feb-2019 16:43:14 Executing: /tmp/tmp.pjWCjMxufw/gpg.1.sh --keyserver
19-Feb-2019 16:43:14 hkp://keyserver.ubuntu.com:80
19-Feb-2019 16:43:14 --recv
19-Feb-2019 16:43:14 EA312927
19-Feb-2019 16:43:14 gpg: requesting key EA312927 from hkp server keyserver.ubuntu.com
19-Feb-2019 16:43:15 gpg: key EA312927: public key "MongoDB 3.2 Release Signing Key <packaging@mongodb.com>" imported
19-Feb-2019 16:43:15 gpg: key EA312927: public key "Totally Legit Signing Key <mallory@example.org>" imported
19-Feb-2019 16:43:15 gpg: Total number processed: 2
19-Feb-2019 16:43:15 gpg:               imported: 2  (RSA: 2)
19-Feb-2019 16:43:15 deb http://repo.mongodb.org/apt/ubuntu xenial/mongodb-org/3.2 multiverse
19-Feb-2019 16:43:15 Ign:1 http://repo.mongodb.org/apt/ubuntu xenial/mongodb-org/3.2 InRelease
19-Feb-2019 16:43:15 Get:2 http://repo.mongodb.org/apt/ubuntu xenial/mongodb-org/3.2 Release [3462 B]
19-Feb-2019 16:43:15 Hit:3 http://security.ubuntu.com/ubuntu xenial-security InRelease
19-Feb-2019 16:43:15 Hit:4 http://archive.ubuntu.com/ubuntu xenial InRelease
19-Feb-2019 16:43:15 Get:5 http://repo.mongodb.org/apt/ubuntu xenial/mongodb-org/3.2 Release.gpg [801 B]
19-Feb-2019 16:43:15 Hit:6 http://archive.ubuntu.com/ubuntu xenial-updates InRelease
19-Feb-2019 16:43:15 Hit:7 http://archive.ubuntu.com/ubuntu xenial-backports InRelease
19-Feb-2019 16:43:15 Get:8 http://repo.mongodb.org/apt/ubuntu xenial/mongodb-org/3.2/multiverse amd64 Packages [11.2 kB]
19-Feb-2019 16:43:15 Fetched 15.5 kB in 0s (25.1 kB/s)
19-Feb-2019 16:43:16 Reading package lists...
19-Feb-2019 16:43:17 Reading package lists...
19-Feb-2019 16:43:17 Building dependency tree...
19-Feb-2019 16:43:17 Reading state information...
19-Feb-2019 16:43:17 python3 is already the newest version (3.5.1-3).
19-Feb-2019 16:43:17 python3 set to manually installed.
19-Feb-2019 16:43:17 The following additional packages will be installed:
19-Feb-2019 16:43:17   binutils build-essential bzip2 cpp cpp-5 dpkg-dev fakeroot g++ g++-5 gcc
19-Feb-2019 16:43:17   gcc-5 ifupdown iproute2 isc-dhcp-client isc-dhcp-common
19-Feb-2019 16:43:17   libalgorithm-diff-perl libalgorithm-diff-xs-perl libalgorithm-merge-perl
19-Feb-2019 16:43:17   libasan2 libatm1 libatomic1 libc-dev-bin libc6-dev libcc1-0 libcilkrts5
19-Feb-2019 16:43:17   libdns-export162 libdpkg-perl libexpat1-dev libfakeroot
19-Feb-2019 16:43:17   libfile-fcntllock-perl libgcc-5-dev libgdbm3 libgomp1 libisc-export160
19-Feb-2019 16:43:17   libisl15 libitm1 liblsan0 libmnl0 libmpc3 libmpfr4 libmpx0 libperl5.22
19-Feb-2019 16:43:17   libpython3-dev libpython3.5 libpython3.5-dev libquadmath0 libstdc++-5-dev
19-Feb-2019 16:43:17   libtsan0 libubsan0 libxtables11 linux-libc-dev make manpages manpages-dev
19-Feb-2019 16:43:17   mongodb-org-mongos mongodb-org-server mongodb-org-shell mongodb-org-tools
19-Feb-2019 16:43:17   netbase patch perl perl-modules-5.22 python-pip-whl python3-dev
19-Feb-2019 16:43:17   python3-pkg-resources python3-setuptools python3-wheel python3.5-dev rename
19-Feb-2019 16:43:17   xz-utils
19-Feb-2019 16:43:17 Suggested packages:
19-Feb-2019 16:43:17   binutils-doc bzip2-doc cpp-doc gcc-5-locales debian-keyring g++-multilib
19-Feb-2019 16:43:17   g++-5-multilib gcc-5-doc libstdc++6-5-dbg gcc-multilib autoconf automake
19-Feb-2019 16:43:17   libtool flex bison gdb gcc-doc gcc-5-multilib libgcc1-dbg libgomp1-dbg
19-Feb-2019 16:43:17   libitm1-dbg libatomic1-dbg libasan2-dbg liblsan0-dbg libtsan0-dbg
19-Feb-2019 16:43:17   libubsan0-dbg libcilkrts5-dbg libmpx0-dbg libquadmath0-dbg ppp rdnssd
19-Feb-2019 16:43:17   iproute2-doc resolvconf avahi-autoipd isc-dhcp-client-ddns apparmor
19-Feb-2019 16:43:17   glibc-doc libstdc++-5-doc make-doc man-browser ed diffutils-doc perl-doc
19-Feb-2019 16:43:17   libterm-readline-gnu-perl | libterm-readline-perl-perl python-setuptools-doc
19-Feb-2019 16:43:17 The following NEW packages will be installed:
19-Feb-2019 16:43:17   binutils build-essential bzip2 cpp cpp-5 dpkg-dev fakeroot g++ g++-5 gcc
19-Feb-2019 16:43:17   gcc-5 ifupdown iproute iproute2 isc-dhcp-client isc-dhcp-common
19-Feb-2019 16:43:17   libalgorithm-diff-perl libalgorithm-diff-xs-perl libalgorithm-merge-perl
19-Feb-2019 16:43:17   libasan2 libatm1 libatomic1 libc-dev-bin libc6-dev libcc1-0 libcilkrts5
19-Feb-2019 16:43:17   libdns-export162 libdpkg-perl libexpat1-dev libfakeroot
19-Feb-2019 16:43:17   libfile-fcntllock-perl libgcc-5-dev libgdbm3 libgomp1 libisc-export160
19-Feb-2019 16:43:17   libisl15 libitm1 liblsan0 libmnl0 libmpc3 libmpfr4 libmpx0 libperl5.22
19-Feb-2019 16:43:17   libpython3-dev libpython3.5 libpython3.5-dev libquadmath0 libstdc++-5-dev
19-Feb-2019 16:43:17   libtsan0 libubsan0 libxtables11 linux-libc-dev make manpages manpages-dev
19-Feb-2019 16:43:17   mongodb-org mongodb-org-mongos mongodb-org-server mongodb-org-shell
19-Feb-2019 16:43:17   mongodb-org-tools net-tools netbase patch perl perl-modules-5.22
19-Feb-2019 16:43:17   python-pip-whl python3-dev python3-pip python3-pkg-resources
19-Feb-2019 16:43:17   python3-setuptools python3-wheel python3.5-dev rename xz-utils
19-Feb-2019 16:43:18 0 upgraded, 74 newly installed, 0 to remove and 4 not upgraded.
19-Feb-2019 16:43:18 Need to get 140 MB of archives.
19-Feb-2019 16:43:18 After this operation, 469 MB of additional disk space will be used.
19-Feb-2019 16:43:18 Get:1 http://repo.mongodb.org/apt/ubuntu xenial/mongodb-org/3.2/multiverse amd64 mongodb-org-shell amd64 3.2.22 [5278 kB]
19-Feb-2019 16:43:18 Get:2 http://archive.ubuntu.com/ubuntu xenial/main amd64 libatm1 amd64 1:2.5.1-1.5 [24.2 kB]
19-Feb-2019 16:43:18 Get:3 http://archive.ubuntu.com/ubuntu xenial/main amd64 libmnl0 amd64 1.0.3-5 [12.0 kB]
19-Feb-2019 16:43:18 Get:4 http://archive.ubuntu.com/ubuntu xenial/main amd64 libgdbm3 amd64 1.8.3-13.1 [16.9 kB]
19-Feb-2019 16:43:18 Get:5 http://repo.mongodb.org/apt/ubuntu xenial/mongodb-org/3.2/multiverse amd64 mongodb-org-server amd64 3.2.22 [10.0 MB]
19-Feb-2019 16:43:18 Get:6 http://archive.ubuntu.com/ubuntu xenial-updates/main amd64 perl-modules-5.22 all 5.22.1-9ubuntu0.6 [2629 kB]
19-Feb-2019 16:43:18 Get:7 http://repo.mongodb.org/apt/ubuntu xenial/mongodb-org/3.2/multiverse amd64 mongodb-org-mongos amd64 3.2.22 [4679 kB]
19-Feb-2019 16:43:18 Get:8 http://repo.mongodb.org/apt/ubuntu xenial/mongodb-org/3.2/multiverse amd64 mongodb-org-tools amd64 3.2.22 [31.8 MB]
19-Feb-2019 16:43:19 Get:9 http://archive.ubuntu.com/ubuntu xenial-updates/main amd64 libperl5.22 amd64 5.22.1-9ubuntu0.6 [3405 kB]
19-Feb-2019 16:43:19 Get:10 http://archive.ubuntu.com/ubuntu xenial-updates/main amd64 perl amd64 5.22.1-9ubuntu0.6 [237 kB]
19-Feb-2019 16:43:19 Get:11 http://archive.ubuntu.com/ubuntu xenial/main amd64 libmpfr4 amd64 3.1.4-1 [191 kB]
19-Feb-2019 16:43:19 Get:12 http://archive.ubuntu.com/ubuntu xenial/main amd64 libmpc3 amd64 1.0.3-1 [39.7 kB]
19-Feb-2019 16:43:19 Get:13 http://archive.ubuntu.com/ubuntu xenial/main amd64 bzip2 amd64 1.0.6-8 [32.7 kB]
19-Feb-2019 16:43:19 Get:14 http://archive.ubuntu.com/ubuntu xenial-updates/main amd64 iproute2 amd64 4.3.0-1ubuntu3.16.04.4 [521 kB]
19-Feb-2019 16:43:19 Get:15 http://archive.ubuntu.com/ubuntu xenial-updates/main amd64 ifupdown amd64 0.8.10ubuntu1.4 [54.9 kB]
19-Feb-2019 16:43:19 Get:16 http://archive.ubuntu.com/ubuntu xenial-updates/main amd64 libisc-export160 amd64 1:9.10.3.dfsg.P4-8ubuntu1.11 [153 kB]
19-Feb-2019 16:43:19 Get:17 http://archive.ubuntu.com/ubuntu xenial-updates/main amd64 libdns-export162 amd64 1:9.10.3.dfsg.P4-8ubuntu1.11 [667 kB]
19-Feb-2019 16:43:19 Get:18 http://archive.ubuntu.com/ubuntu xenial-updates/main amd64 isc-dhcp-client amd64 4.3.3-5ubuntu12.10 [224 kB]
19-Feb-2019 16:43:19 Get:19 http://archive.ubuntu.com/ubuntu xenial-updates/main amd64 isc-dhcp-common amd64 4.3.3-5ubuntu12.10 [105 kB]
19-Feb-2019 16:43:19 Get:20 http://archive.ubuntu.com/ubuntu xenial/main amd64 libxtables11 amd64 1.6.0-2ubuntu3 [27.2 kB]
19-Feb-2019 16:43:19 Get:21 http://archive.ubuntu.com/ubuntu xenial/main amd64 net-tools amd64 1.60-26ubuntu1 [175 kB]
19-Feb-2019 16:43:19 Get:22 http://archive.ubuntu.com/ubuntu xenial/main amd64 netbase all 5.3 [12.9 kB]
19-Feb-2019 16:43:19 Get:23 http://archive.ubuntu.com/ubuntu xenial/main amd64 manpages all 4.04-2 [1087 kB]
19-Feb-2019 16:43:19 Get:24 http://archive.ubuntu.com/ubuntu xenial-updates/main amd64 binutils amd64 2.26.1-1ubuntu1~16.04.7 [2309 kB]
19-Feb-2019 16:43:19 Get:25 http://archive.ubuntu.com/ubuntu xenial-updates/main amd64 libc-dev-bin amd64 2.23-0ubuntu10 [68.7 kB]
19-Feb-2019 16:43:19 Get:26 http://archive.ubuntu.com/ubuntu xenial-updates/main amd64 linux-libc-dev amd64 4.4.0-142.168 [867 kB]
19-Feb-2019 16:43:19 Get:27 http://repo.mongodb.org/apt/ubuntu xenial/mongodb-org/3.2/multiverse amd64 mongodb-org amd64 3.2.22 [3564 B]
19-Feb-2019 16:43:19 Get:28 http://archive.ubuntu.com/ubuntu xenial-updates/main amd64 libc6-dev amd64 2.23-0ubuntu10 [2079 kB]
19-Feb-2019 16:43:19 Get:29 http://archive.ubuntu.com/ubuntu xenial/main amd64 libisl15 amd64 0.16.1-1 [524 kB]
19-Feb-2019 16:43:19 Get:30 http://archive.ubuntu.com/ubuntu xenial-updates/main amd64 cpp-5 amd64 5.4.0-6ubuntu1~16.04.11 [7660 kB]
19-Feb-2019 16:43:19 Get:31 http://archive.ubuntu.com/ubuntu xenial/main amd64 cpp amd64 4:5.3.1-1ubuntu1 [27.7 kB]
19-Feb-2019 16:43:19 Get:32 http://archive.ubuntu.com/ubuntu xenial-updates/main amd64 libcc1-0 amd64 5.4.0-6ubuntu1~16.04.11 [38.8 kB]
19-Feb-2019 16:43:19 Get:33 http://archive.ubuntu.com/ubuntu xenial-updates/main amd64 libgomp1 amd64 5.4.0-6ubuntu1~16.04.11 [55.0 kB]
19-Feb-2019 16:43:19 Get:34 http://archive.ubuntu.com/ubuntu xenial-updates/main amd64 libitm1 amd64 5.4.0-6ubuntu1~16.04.11 [27.4 kB]
19-Feb-2019 16:43:19 Get:35 http://archive.ubuntu.com/ubuntu xenial-updates/main amd64 libatomic1 amd64 5.4.0-6ubuntu1~16.04.11 [8896 B]
19-Feb-2019 16:43:19 Get:36 http://archive.ubuntu.com/ubuntu xenial-updates/main amd64 libasan2 amd64 5.4.0-6ubuntu1~16.04.11 [264 kB]
19-Feb-2019 16:43:19 Get:37 http://archive.ubuntu.com/ubuntu xenial-updates/main amd64 liblsan0 amd64 5.4.0-6ubuntu1~16.04.11 [105 kB]
19-Feb-2019 16:43:19 Get:38 http://archive.ubuntu.com/ubuntu xenial-updates/main amd64 libtsan0 amd64 5.4.0-6ubuntu1~16.04.11 [244 kB]
19-Feb-2019 16:43:19 Get:39 http://archive.ubuntu.com/ubuntu xenial-updates/main amd64 libubsan0 amd64 5.4.0-6ubuntu1~16.04.11 [95.4 kB]
19-Feb-2019 16:43:19 Get:40 http://archive.ubuntu.com/ubuntu xenial-updates/main amd64 libcilkrts5 amd64 5.4.0-6ubuntu1~16.04.11 [40.1 kB]
19-Feb-2019 16:43:20 Get:41 http://archive.ubuntu.com/ubuntu xenial-updates/main amd64 libmpx0 amd64 5.4.0-6ubuntu1~16.04.11 [9748 B]
19-Feb-2019 16:43:20 Get:42 http://archive.ubuntu.com/ubuntu xenial-updates/main amd64 libquadmath0 amd64 5.4.0-6ubuntu1~16.04.11 [131 kB]
19-Feb-2019 16:43:20 Get:43 http://archive.ubuntu.com/ubuntu xenial-updates/main amd64 libgcc-5-dev amd64 5.4.0-6ubuntu1~16.04.11 [2229 kB]
19-Feb-2019 16:43:20 Get:44 http://archive.ubuntu.com/ubuntu xenial-updates/main amd64 gcc-5 amd64 5.4.0-6ubuntu1~16.04.11 [8417 kB]
19-Feb-2019 16:43:20 Get:45 http://archive.ubuntu.com/ubuntu xenial/main amd64 gcc amd64 4:5.3.1-1ubuntu1 [5244 B]
19-Feb-2019 16:43:20 Get:46 http://archive.ubuntu.com/ubuntu xenial-updates/main amd64 libstdc++-5-dev amd64 5.4.0-6ubuntu1~16.04.11 [1426 kB]
19-Feb-2019 16:43:20 Get:47 http://archive.ubuntu.com/ubuntu xenial-updates/main amd64 g++-5 amd64 5.4.0-6ubuntu1~16.04.11 [8310 kB]
19-Feb-2019 16:43:20 Get:48 http://archive.ubuntu.com/ubuntu xenial/main amd64 g++ amd64 4:5.3.1-1ubuntu1 [1504 B]
19-Feb-2019 16:43:20 Get:49 http://archive.ubuntu.com/ubuntu xenial/main amd64 make amd64 4.1-6 [151 kB]
19-Feb-2019 16:43:20 Get:50 http://archive.ubuntu.com/ubuntu xenial-updates/main amd64 libdpkg-perl all 1.18.4ubuntu1.5 [195 kB]
19-Feb-2019 16:43:20 Get:51 http://archive.ubuntu.com/ubuntu xenial/main amd64 xz-utils amd64 5.1.1alpha+20120614-2ubuntu2 [78.8 kB]
19-Feb-2019 16:43:20 Get:52 http://archive.ubuntu.com/ubuntu xenial-updates/main amd64 patch amd64 2.7.5-1ubuntu0.16.04.1 [90.5 kB]
19-Feb-2019 16:43:20 Get:53 http://archive.ubuntu.com/ubuntu xenial-updates/main amd64 dpkg-dev all 1.18.4ubuntu1.5 [584 kB]
19-Feb-2019 16:43:20 Get:54 http://archive.ubuntu.com/ubuntu xenial/main amd64 build-essential amd64 12.1ubuntu2 [4758 B]
19-Feb-2019 16:43:20 Get:55 http://archive.ubuntu.com/ubuntu xenial/main amd64 libfakeroot amd64 1.20.2-1ubuntu1 [25.5 kB]
19-Feb-2019 16:43:20 Get:56 http://archive.ubuntu.com/ubuntu xenial/main amd64 fakeroot amd64 1.20.2-1ubuntu1 [61.8 kB]
19-Feb-2019 16:43:20 Get:57 http://archive.ubuntu.com/ubuntu xenial-updates/main amd64 iproute all 1:4.3.0-1ubuntu3.16.04.4 [2438 B]
19-Feb-2019 16:43:20 Get:58 http://archive.ubuntu.com/ubuntu xenial/main amd64 libalgorithm-diff-perl all 1.19.03-1 [47.6 kB]
19-Feb-2019 16:43:20 Get:59 http://archive.ubuntu.com/ubuntu xenial/main amd64 libalgorithm-diff-xs-perl amd64 0.04-4build1 [11.0 kB]
19-Feb-2019 16:43:20 Get:60 http://archive.ubuntu.com/ubuntu xenial/main amd64 libalgorithm-merge-perl all 0.08-3 [12.0 kB]
19-Feb-2019 16:43:20 Get:61 http://archive.ubuntu.com/ubuntu xenial-updates/main amd64 libexpat1-dev amd64 2.1.0-7ubuntu0.16.04.3 [115 kB]
19-Feb-2019 16:43:20 Get:62 http://archive.ubuntu.com/ubuntu xenial/main amd64 libfile-fcntllock-perl amd64 0.22-3 [32.0 kB]
19-Feb-2019 16:43:20 Get:63 http://archive.ubuntu.com/ubuntu xenial-updates/main amd64 libpython3.5 amd64 3.5.2-2ubuntu0~16.04.5 [1360 kB]
19-Feb-2019 16:43:20 Get:64 http://archive.ubuntu.com/ubuntu xenial-updates/main amd64 libpython3.5-dev amd64 3.5.2-2ubuntu0~16.04.5 [37.3 MB]
19-Feb-2019 16:43:22 Get:65 http://archive.ubuntu.com/ubuntu xenial/main amd64 libpython3-dev amd64 3.5.1-3 [6926 B]
19-Feb-2019 16:43:22 Get:66 http://archive.ubuntu.com/ubuntu xenial/main amd64 manpages-dev all 4.04-2 [2048 kB]
19-Feb-2019 16:43:22 Get:67 http://archive.ubuntu.com/ubuntu xenial-updates/universe amd64 python-pip-whl all 8.1.1-2ubuntu0.4 [1110 kB]
19-Feb-2019 16:43:22 Get:68 http://archive.ubuntu.com/ubuntu xenial-updates/main amd64 python3.5-dev amd64 3.5.2-2ubuntu0~16.04.5 [413 kB]
19-Feb-2019 16:43:22 Get:69 http://archive.ubuntu.com/ubuntu xenial/main amd64 python3-dev amd64 3.5.1-3 [1186 B]
19-Feb-2019 16:43:22 Get:70 http://archive.ubuntu.com/ubuntu xenial-updates/universe amd64 python3-pip all 8.1.1-2ubuntu0.4 [109 kB]
19-Feb-2019 16:43:22 Get:71 http://archive.ubuntu.com/ubuntu xenial/main amd64 python3-pkg-resources all 20.7.0-1 [79.0 kB]
19-Feb-2019 16:43:22 Get:72 http://archive.ubuntu.com/ubuntu xenial/main amd64 python3-setuptools all 20.7.0-1 [88.0 kB]
19-Feb-2019 16:43:22 Get:73 http://archive.ubuntu.com/ubuntu xenial/universe amd64 python3-wheel all 0.29.0-1 [48.1 kB]
19-Feb-2019 16:43:22 Get:74 http://archive.ubuntu.com/ubuntu xenial/main amd64 rename all 0.20-4 [12.0 kB]
19-Feb-2019 16:43:22 debconf: delaying package configuration, since apt-utils is not installed
19-Feb-2019 16:43:22 Fetched 140 MB in 4s (32.4 MB/s)
19-Feb-2019 16:43:23 Selecting previously unselected package libatm1:amd64.
19-Feb-2019 16:43:23 (Reading database ...
19-Feb-2019 16:43:23 (Reading database ... 5%
19-Feb-2019 16:43:23 (Reading database ... 10%
19-Feb-2019 16:43:23 (Reading database ... 15%
19-Feb-2019 16:43:23 (Reading database ... 20%
19-Feb-2019 16:43:23 (Reading database ... 25%
19-Feb-2019 16:43:23 (Reading database ... 30%
19-Feb-2019 16:43:23 (Reading database ... 35%
19-Feb-2019 16:43:23 (Reading database ... 40%
19-Feb-2019 16:43:23 (Reading database ... 45%
19-Feb-2019 16:43:23 (Reading database ... 50%
19-Feb-2019 16:43:23 (Reading database ... 55%
19-Feb-2019 16:43:23 (Reading database ... 60%
19-Feb-2019 16:43:23 (Reading database ... 65%
19-Feb-2019 16:43:23 (Reading database ... 70%
19-Feb-2019 16:43:23 (Reading database ... 75%
19-Feb-2019 16:43:23 (Reading database ... 80%
19-Feb-2019 16:43:23 (Reading database ... 85%
19-Feb-2019 16:43:23 (Reading database ... 90%
19-Feb-2019 16:43:23 (Reading database ... 95%
19-Feb-2019 16:43:23 (Reading database ... 100%
19-Feb-2019 16:43:23 (Reading database ... 6336 files and directories currently installed.)
19-Feb-2019 16:43:23 Preparing to unpack .../libatm1_1%3a2.5.1-1.5_amd64.deb ...
19-Feb-2019 16:43:23 Unpacking libatm1:amd64 (1:2.5.1-1.5) ...
19-Feb-2019 16:43:23 Selecting previously unselected package libmnl0:amd64.
19-Feb-2019 16:43:23 Preparing to unpack .../libmnl0_1.0.3-5_amd64.deb ...
19-Feb-2019 16:43:23 Unpacking libmnl0:amd64 (1.0.3-5) ...
19-Feb-2019 16:43:24 Selecting previously unselected package libgdbm3:amd64.
19-Feb-2019 16:43:24 Preparing to unpack .../libgdbm3_1.8.3-13.1_amd64.deb ...
19-Feb-2019 16:43:24 Unpacking libgdbm3:amd64 (1.8.3-13.1) ...
19-Feb-2019 16:43:24 Selecting previously unselected package perl-modules-5.22.
19-Feb-2019 16:43:24 Preparing to unpack .../perl-modules-5.22_5.22.1-9ubuntu0.6_all.deb ...
19-Feb-2019 16:43:24 Unpacking perl-modules-5.22 (5.22.1-9ubuntu0.6) ...
19-Feb-2019 16:43:26 Selecting previously unselected package libperl5.22:amd64.
19-Feb-2019 16:43:26 Preparing to unpack .../libperl5.22_5.22.1-9ubuntu0.6_amd64.deb ...
19-Feb-2019 16:43:26 Unpacking libperl5.22:amd64 (5.22.1-9ubuntu0.6) ...
19-Feb-2019 16:43:27 Selecting previously unselected package perl.
19-Feb-2019 16:43:27 Preparing to unpack .../perl_5.22.1-9ubuntu0.6_amd64.deb ...
19-Feb-2019 16:43:28 Unpacking perl (5.22.1-9ubuntu0.6) ...
19-Feb-2019 16:43:28 Selecting previously unselected package libmpfr4:amd64.
19-Feb-2019 16:43:28 Preparing to unpack .../libmpfr4_3.1.4-1_amd64.deb ...
19-Feb-2019 16:43:28 Unpacking libmpfr4:amd64 (3.1.4-1) ...
19-Feb-2019 16:43:28 Selecting previously unselected package libmpc3:amd64.
19-Feb-2019 16:43:28 Preparing to unpack .../libmpc3_1.0.3-1_amd64.deb ...
19-Feb-2019 16:43:28 Unpacking libmpc3:amd64 (1.0.3-1) ...
19-Feb-2019 16:43:29 Selecting previously unselected package bzip2.
19-Feb-2019 16:43:29 Preparing to unpack .../bzip2_1.0.6-8_amd64.deb ...
19-Feb-2019 16:43:29 Unpacking bzip2 (1.0.6-8) ...
19-Feb-2019 16:43:29 Selecting previously unselected package iproute2.
19-Feb-2019 16:43:29 Preparing to unpack .../iproute2_4.3.0-1ubuntu3.16.04.4_amd64.deb ...
19-Feb-2019 16:43:29 Unpacking iproute2 (4.3.0-1ubuntu3.16.04.4) ...
19-Feb-2019 16:43:30 Selecting previously unselected package ifupdown.
19-Feb-2019 16:43:30 Preparing to unpack .../ifupdown_0.8.10ubuntu1.4_amd64.deb ...
19-Feb-2019 16:43:30 Unpacking ifupdown (0.8.10ubuntu1.4) ...
19-Feb-2019 16:43:31 Selecting previously unselected package libisc-export160.
19-Feb-2019 16:43:31 Preparing to unpack .../libisc-export160_1%3a9.10.3.dfsg.P4-8ubuntu1.11_amd64.deb ...
19-Feb-2019 16:43:31 Unpacking libisc-export160 (1:9.10.3.dfsg.P4-8ubuntu1.11) ...
19-Feb-2019 16:43:31 Selecting previously unselected package libdns-export162.
19-Feb-2019 16:43:31 Preparing to unpack .../libdns-export162_1%3a9.10.3.dfsg.P4-8ubuntu1.11_amd64.deb ...
19-Feb-2019 16:43:31 Unpacking libdns-export162 (1:9.10.3.dfsg.P4-8ubuntu1.11) ...
19-Feb-2019 16:43:32 Selecting previously unselected package isc-dhcp-client.
19-Feb-2019 16:43:32 Preparing to unpack .../isc-dhcp-client_4.3.3-5ubuntu12.10_amd64.deb ...
19-Feb-2019 16:43:32 Unpacking isc-dhcp-client (4.3.3-5ubuntu12.10) ...
19-Feb-2019 16:43:32 Selecting previously unselected package isc-dhcp-common.
19-Feb-2019 16:43:32 Preparing to unpack .../isc-dhcp-common_4.3.3-5ubuntu12.10_amd64.deb ...
19-Feb-2019 16:43:32 Unpacking isc-dhcp-common (4.3.3-5ubuntu12.10) ...
19-Feb-2019 16:43:32 Selecting previously unselected package libxtables11:amd64.
19-Feb-2019 16:43:32 Preparing to unpack .../libxtables11_1.6.0-2ubuntu3_amd64.deb ...
19-Feb-2019 16:43:32 Unpacking libxtables11:amd64 (1.6.0-2ubuntu3) ...
19-Feb-2019 16:43:33 Selecting previously unselected package net-tools.
19-Feb-2019 16:43:33 Preparing to unpack .../net-tools_1.60-26ubuntu1_amd64.deb ...
19-Feb-2019 16:43:33 Unpacking net-tools (1.60-26ubuntu1) ...
19-Feb-2019 16:43:33 Selecting previously unselected package netbase.
19-Feb-2019 16:43:33 Preparing to unpack .../archives/netbase_5.3_all.deb ...
19-Feb-2019 16:43:33 Unpacking netbase (5.3) ...
19-Feb-2019 16:43:33 Selecting previously unselected package manpages.
19-Feb-2019 16:43:33 Preparing to unpack .../manpages_4.04-2_all.deb ...
19-Feb-2019 16:43:33 Unpacking manpages (4.04-2) ...
19-Feb-2019 16:43:34 Selecting previously unselected package binutils.
19-Feb-2019 16:43:34 Preparing to unpack .../binutils_2.26.1-1ubuntu1~16.04.7_amd64.deb ...
19-Feb-2019 16:43:34 Unpacking binutils (2.26.1-1ubuntu1~16.04.7) ...
19-Feb-2019 16:43:34 Selecting previously unselected package libc-dev-bin.
19-Feb-2019 16:43:34 Preparing to unpack .../libc-dev-bin_2.23-0ubuntu10_amd64.deb ...
19-Feb-2019 16:43:34 Unpacking libc-dev-bin (2.23-0ubuntu10) ...
19-Feb-2019 16:43:35 Selecting previously unselected package linux-libc-dev:amd64.
19-Feb-2019 16:43:35 Preparing to unpack .../linux-libc-dev_4.4.0-142.168_amd64.deb ...
19-Feb-2019 16:43:35 Unpacking linux-libc-dev:amd64 (4.4.0-142.168) ...
19-Feb-2019 16:43:36 Selecting previously unselected package libc6-dev:amd64.
19-Feb-2019 16:43:36 Preparing to unpack .../libc6-dev_2.23-0ubuntu10_amd64.deb ...
19-Feb-2019 16:43:36 Unpacking libc6-dev:amd64 (2.23-0ubuntu10) ...
19-Feb-2019 16:43:37 Selecting previously unselected package libisl15:amd64.
19-Feb-2019 16:43:37 Preparing to unpack .../libisl15_0.16.1-1_amd64.deb ...
19-Feb-2019 16:43:37 Unpacking libisl15:amd64 (0.16.1-1) ...
19-Feb-2019 16:43:38 Selecting previously unselected package cpp-5.
19-Feb-2019 16:43:38 Preparing to unpack .../cpp-5_5.4.0-6ubuntu1~16.04.11_amd64.deb ...
19-Feb-2019 16:43:38 Unpacking cpp-5 (5.4.0-6ubuntu1~16.04.11) ...
19-Feb-2019 16:43:39 Selecting previously unselected package cpp.
19-Feb-2019 16:43:39 Preparing to unpack .../cpp_4%3a5.3.1-1ubuntu1_amd64.deb ...
19-Feb-2019 16:43:39 Unpacking cpp (4:5.3.1-1ubuntu1) ...
19-Feb-2019 16:43:40 Selecting previously unselected package libcc1-0:amd64.
19-Feb-2019 16:43:40 Preparing to unpack .../libcc1-0_5.4.0-6ubuntu1~16.04.11_amd64.deb ...
19-Feb-2019 16:43:40 Unpacking libcc1-0:amd64 (5.4.0-6ubuntu1~16.04.11) ...
19-Feb-2019 16:43:40 Selecting previously unselected package libgomp1:amd64.
19-Feb-2019 16:43:40 Preparing to unpack .../libgomp1_5.4.0-6ubuntu1~16.04.11_amd64.deb ...
19-Feb-2019 16:43:40 Unpacking libgomp1:amd64 (5.4.0-6ubuntu1~16.04.11) ...
19-Feb-2019 16:43:41 Selecting previously unselected package libitm1:amd64.
19-Feb-2019 16:43:41 Preparing to unpack .../libitm1_5.4.0-6ubuntu1~16.04.11_amd64.deb ...
19-Feb-2019 16:43:41 Unpacking libitm1:amd64 (5.4.0-6ubuntu1~16.04.11) ...
19-Feb-2019 16:43:41 Selecting previously unselected package libatomic1:amd64.
19-Feb-2019 16:43:41 Preparing to unpack .../libatomic1_5.4.0-6ubuntu1~16.04.11_amd64.deb ...
19-Feb-2019 16:43:41 Unpacking libatomic1:amd64 (5.4.0-6ubuntu1~16.04.11) ...
19-Feb-2019 16:43:42 Selecting previously unselected package libasan2:amd64.
19-Feb-2019 16:43:42 Preparing to unpack .../libasan2_5.4.0-6ubuntu1~16.04.11_amd64.deb ...
19-Feb-2019 16:43:42 Unpacking libasan2:amd64 (5.4.0-6ubuntu1~16.04.11) ...
19-Feb-2019 16:43:42 Selecting previously unselected package liblsan0:amd64.
19-Feb-2019 16:43:42 Preparing to unpack .../liblsan0_5.4.0-6ubuntu1~16.04.11_amd64.deb ...
19-Feb-2019 16:43:42 Unpacking liblsan0:amd64 (5.4.0-6ubuntu1~16.04.11) ...
19-Feb-2019 16:43:42 Selecting previously unselected package libtsan0:amd64.
19-Feb-2019 16:43:42 Preparing to unpack .../libtsan0_5.4.0-6ubuntu1~16.04.11_amd64.deb ...
19-Feb-2019 16:43:42 Unpacking libtsan0:amd64 (5.4.0-6ubuntu1~16.04.11) ...
19-Feb-2019 16:43:43 Selecting previously unselected package libubsan0:amd64.
19-Feb-2019 16:43:43 Preparing to unpack .../libubsan0_5.4.0-6ubuntu1~16.04.11_amd64.deb ...
19-Feb-2019 16:43:43 Unpacking libubsan0:amd64 (5.4.0-6ubuntu1~16.04.11) ...
19-Feb-2019 16:43:44 Selecting previously unselected package libcilkrts5:amd64.
19-Feb-2019 16:43:44 Preparing to unpack .../libcilkrts5_5.4.0-6ubuntu1~16.04.11_amd64.deb ...
19-Feb-2019 16:43:44 Unpacking libcilkrts5:amd64 (5.4.0-6ubuntu1~16.04.11) ...
19-Feb-2019 16:43:44 Selecting previously unselected package libmpx0:amd64.
19-Feb-2019 16:43:44 Preparing to unpack .../libmpx0_5.4.0-6ubuntu1~16.04.11_amd64.deb ...
19-Feb-2019 16:43:44 Unpacking libmpx0:amd64 (5.4.0-6ubuntu1~16.04.11) ...
19-Feb-2019 16:43:44 Selecting previously unselected package libquadmath0:amd64.
19-Feb-2019 16:43:44 Preparing to unpack .../libquadmath0_5.4.0-6ubuntu1~16.04.11_amd64.deb ...
19-Feb-2019 16:43:44 Unpacking libquadmath0:amd64 (5.4.0-6ubuntu1~16.04.11) ...
19-Feb-2019 16:43:45 Selecting previously unselected package libgcc-5-dev:amd64.
19-Feb-2019 16:43:45 Preparing to unpack .../libgcc-5-dev_5.4.0-6ubuntu1~16.04.11_amd64.deb ...
19-Feb-2019 16:43:45 Unpacking libgcc-5-dev:amd64 (5.4.0-6ubuntu1~16.04.11) ...
19-Feb-2019 16:43:45 Selecting previously unselected package gcc-5.
19-Feb-2019 16:43:45 Preparing to unpack .../gcc-5_5.4.0-6ubuntu1~16.04.11_amd64.deb ...
19-Feb-2019 16:43:46 Unpacking gcc-5 (5.4.0-6ubuntu1~16.04.11) ...
19-Feb-2019 16:43:47 Selecting previously unselected package gcc.
19-Feb-2019 16:43:47 Preparing to unpack .../gcc_4%3a5.3.1-1ubuntu1_amd64.deb ...
19-Feb-2019 16:43:47 Unpacking gcc (4:5.3.1-1ubuntu1) ...
19-Feb-2019 16:43:48 Selecting previously unselected package libstdc++-5-dev:amd64.
19-Feb-2019 16:43:48 Preparing to unpack .../libstdc++-5-dev_5.4.0-6ubuntu1~16.04.11_amd64.deb ...
19-Feb-2019 16:43:48 Unpacking libstdc++-5-dev:amd64 (5.4.0-6ubuntu1~16.04.11) ...
19-Feb-2019 16:43:49 Selecting previously unselected package g++-5.
19-Feb-2019 16:43:49 Preparing to unpack .../g++-5_5.4.0-6ubuntu1~16.04.11_amd64.deb ...
19-Feb-2019 16:43:49 Unpacking g++-5 (5.4.0-6ubuntu1~16.04.11) ...
19-Feb-2019 16:43:51 Selecting previously unselected package g++.
19-Feb-2019 16:43:51 Preparing to unpack .../g++_4%3a5.3.1-1ubuntu1_amd64.deb ...
19-Feb-2019 16:43:51 Unpacking g++ (4:5.3.1-1ubuntu1) ...
19-Feb-2019 16:43:51 Selecting previously unselected package make.
19-Feb-2019 16:43:51 Preparing to unpack .../archives/make_4.1-6_amd64.deb ...
19-Feb-2019 16:43:51 Unpacking make (4.1-6) ...
19-Feb-2019 16:43:52 Selecting previously unselected package libdpkg-perl.
19-Feb-2019 16:43:52 Preparing to unpack .../libdpkg-perl_1.18.4ubuntu1.5_all.deb ...
19-Feb-2019 16:43:52 Unpacking libdpkg-perl (1.18.4ubuntu1.5) ...
19-Feb-2019 16:43:52 Selecting previously unselected package xz-utils.
19-Feb-2019 16:43:52 Preparing to unpack .../xz-utils_5.1.1alpha+20120614-2ubuntu2_amd64.deb ...
19-Feb-2019 16:43:52 Unpacking xz-utils (5.1.1alpha+20120614-2ubuntu2) ...
19-Feb-2019 16:43:52 Selecting previously unselected package patch.
19-Feb-2019 16:43:52 Preparing to unpack .../patch_2.7.5-1ubuntu0.16.04.1_amd64.deb ...
19-Feb-2019 16:43:52 Unpacking patch (2.7.5-1ubuntu0.16.04.1) ...
19-Feb-2019 16:43:53 Selecting previously unselected package dpkg-dev.
19-Feb-2019 16:43:53 Preparing to unpack .../dpkg-dev_1.18.4ubuntu1.5_all.deb ...
19-Feb-2019 16:43:53 Unpacking dpkg-dev (1.18.4ubuntu1.5) ...
19-Feb-2019 16:43:53 Selecting previously unselected package build-essential.
19-Feb-2019 16:43:53 Preparing to unpack .../build-essential_12.1ubuntu2_amd64.deb ...
19-Feb-2019 16:43:53 Unpacking build-essential (12.1ubuntu2) ...
19-Feb-2019 16:43:53 Selecting previously unselected package libfakeroot:amd64.
19-Feb-2019 16:43:53 Preparing to unpack .../libfakeroot_1.20.2-1ubuntu1_amd64.deb ...
19-Feb-2019 16:43:53 Unpacking libfakeroot:amd64 (1.20.2-1ubuntu1) ...
19-Feb-2019 16:43:54 Selecting previously unselected package fakeroot.
19-Feb-2019 16:43:54 Preparing to unpack .../fakeroot_1.20.2-1ubuntu1_amd64.deb ...
19-Feb-2019 16:43:54 Unpacking fakeroot (1.20.2-1ubuntu1) ...
19-Feb-2019 16:43:54 Selecting previously unselected package iproute.
19-Feb-2019 16:43:54 Preparing to unpack .../iproute_1%3a4.3.0-1ubuntu3.16.04.4_all.deb ...
19-Feb-2019 16:43:54 Unpacking iproute (1:4.3.0-1ubuntu3.16.04.4) ...
19-Feb-2019 16:43:54 Selecting previously unselected package libalgorithm-diff-perl.
19-Feb-2019 16:43:54 Preparing to unpack .../libalgorithm-diff-perl_1.19.03-1_all.deb ...
19-Feb-2019 16:43:54 Unpacking libalgorithm-diff-perl (1.19.03-1) ...
19-Feb-2019 16:43:55 Selecting previously unselected package libalgorithm-diff-xs-perl.
19-Feb-2019 16:43:55 Preparing to unpack .../libalgorithm-diff-xs-perl_0.04-4build1_amd64.deb ...
19-Feb-2019 16:43:55 Unpacking libalgorithm-diff-xs-perl (0.04-4build1) ...
19-Feb-2019 16:43:55 Selecting previously unselected package libalgorithm-merge-perl.
19-Feb-2019 16:43:55 Preparing to unpack .../libalgorithm-merge-perl_0.08-3_all.deb ...
19-Feb-2019 16:43:55 Unpacking libalgorithm-merge-perl (0.08-3) ...
19-Feb-2019 16:43:55 Selecting previously unselected package libexpat1-dev:amd64.
19-Feb-2019 16:43:55 Preparing to unpack .../libexpat1-dev_2.1.0-7ubuntu0.16.04.3_amd64.deb ...
19-Feb-2019 16:43:55 Unpacking libexpat1-dev:amd64 (2.1.0-7ubuntu0.16.04.3) ...
19-Feb-2019 16:43:56 Selecting previously unselected package libfile-fcntllock-perl.
19-Feb-2019 16:43:56 Preparing to unpack .../libfile-fcntllock-perl_0.22-3_amd64.deb ...
19-Feb-2019 16:43:56 Unpacking libfile-fcntllock-perl (0.22-3) ...
19-Feb-2019 16:43:56 Selecting previously unselected package libpython3.5:amd64.
19-Feb-2019 16:43:56 Preparing to unpack .../libpython3.5_3.5.2-2ubuntu0~16.04.5_amd64.deb ...
19-Feb-2019 16:43:56 Unpacking libpython3.5:amd64 (3.5.2-2ubuntu0~16.04.5) ...
19-Feb-2019 16:43:57 Selecting previously unselected package libpython3.5-dev:amd64.
19-Feb-2019 16:43:57 Preparing to unpack .../libpython3.5-dev_3.5.2-2ubuntu0~16.04.5_amd64.deb ...
19-Feb-2019 16:43:57 Unpacking libpython3.5-dev:amd64 (3.5.2-2ubuntu0~16.04.5) ...
19-Feb-2019 16:44:01 Selecting previously unselected package libpython3-dev:amd64.
19-Feb-2019 16:44:01 Preparing to unpack .../libpython3-dev_3.5.1-3_amd64.deb ...
19-Feb-2019 16:44:01 Unpacking libpython3-dev:amd64 (3.5.1-3) ...
19-Feb-2019 16:44:01 Selecting previously unselected package manpages-dev.
19-Feb-2019 16:44:01 Preparing to unpack .../manpages-dev_4.04-2_all.deb ...
19-Feb-2019 16:44:01 Unpacking manpages-dev (4.04-2) ...
19-Feb-2019 16:44:02 Selecting previously unselected package mongodb-org-shell.
19-Feb-2019 16:44:02 Preparing to unpack .../mongodb-org-shell_3.2.22_amd64.deb ...
19-Feb-2019 16:44:02 Unpacking mongodb-org-shell (3.2.22) ...
19-Feb-2019 16:44:03 Selecting previously unselected package mongodb-org-server.
19-Feb-2019 16:44:03 Preparing to unpack .../mongodb-org-server_3.2.22_amd64.deb ...
19-Feb-2019 16:44:04 Unpacking mongodb-org-server (3.2.22) ...
19-Feb-2019 16:44:06 Selecting previously unselected package mongodb-org-mongos.
19-Feb-2019 16:44:06 Preparing to unpack .../mongodb-org-mongos_3.2.22_amd64.deb ...
19-Feb-2019 16:44:06 Unpacking mongodb-org-mongos (3.2.22) ...
19-Feb-2019 16:44:07 Selecting previously unselected package mongodb-org-tools.
19-Feb-2019 16:44:07 Preparing to unpack .../mongodb-org-tools_3.2.22_amd64.deb ...
19-Feb-2019 16:44:07 Unpacking mongodb-org-tools (3.2.22) ...
19-Feb-2019 16:44:11 Selecting previously unselected package mongodb-org.
19-Feb-2019 16:44:11 Preparing to unpack .../mongodb-org_3.2.22_amd64.deb ...
19-Feb-2019 16:44:11 Unpacking mongodb-org (3.2.22) ...
19-Feb-2019 16:44:11 Selecting previously unselected package python-pip-whl.
19-Feb-2019 16:44:11 Preparing to unpack .../python-pip-whl_8.1.1-2ubuntu0.4_all.deb ...
19-Feb-2019 16:44:11 Unpacking python-pip-whl (8.1.1-2ubuntu0.4) ...
19-Feb-2019 16:44:12 Selecting previously unselected package python3.5-dev.
19-Feb-2019 16:44:12 Preparing to unpack .../python3.5-dev_3.5.2-2ubuntu0~16.04.5_amd64.deb ...
19-Feb-2019 16:44:12 Unpacking python3.5-dev (3.5.2-2ubuntu0~16.04.5) ...
19-Feb-2019 16:44:12 Selecting previously unselected package python3-dev.
19-Feb-2019 16:44:12 Preparing to unpack .../python3-dev_3.5.1-3_amd64.deb ...
19-Feb-2019 16:44:12 Unpacking python3-dev (3.5.1-3) ...
19-Feb-2019 16:44:12 Selecting previously unselected package python3-pip.
19-Feb-2019 16:44:12 Preparing to unpack .../python3-pip_8.1.1-2ubuntu0.4_all.deb ...
19-Feb-2019 16:44:13 Unpacking python3-pip (8.1.1-2ubuntu0.4) ...
19-Feb-2019 16:44:13 Selecting previously unselected package python3-pkg-resources.
19-Feb-2019 16:44:13 Preparing to unpack .../python3-pkg-resources_20.7.0-1_all.deb ...
19-Feb-2019 16:44:13 Unpacking python3-pkg-resources (20.7.0-1) ...
19-Feb-2019 16:44:13 Selecting previously unselected package python3-setuptools.
19-Feb-2019 16:44:13 Preparing to unpack .../python3-setuptools_20.7.0-1_all.deb ...
19-Feb-2019 16:44:13 Unpacking python3-setuptools (20.7.0-1) ...
19-Feb-2019 16:44:14 Selecting previously unselected package python3-wheel.
19-Feb-2019 16:44:14 Preparing to unpack .../python3-wheel_0.29.0-1_all.deb ...
19-Feb-2019 16:44:14 Unpacking python3-wheel (0.29.0-1) ...
19-Feb-2019 16:44:14 Selecting previously unselected package rename.
19-Feb-2019 16:44:14 Preparing to unpack .../archives/rename_0.20-4_all.deb ...
19-Feb-2019 16:44:14 Unpacking rename (0.20-4) ...
19-Feb-2019 16:44:14 Processing triggers for libc-bin (2.23-0ubuntu10) ...
19-Feb-2019 16:44:14 Processing triggers for systemd (229-4ubuntu21.15) ...
19-Feb-2019 16:44:15 Setting up libatm1:amd64 (1:2.5.1-1.5) ...
19-Feb-2019 16:44:15 Setting up libmnl0:amd64 (1.0.3-5) ...
19-Feb-2019 16:44:15 Setting up libgdbm3:amd64 (1.8.3-13.1) ...
19-Feb-2019 16:44:15 Setting up perl-modules-5.22 (5.22.1-9ubuntu0.6) ...
19-Feb-2019 16:44:15 Setting up libperl5.22:amd64 (5.22.1-9ubuntu0.6) ...
19-Feb-2019 16:44:16 Setting up perl (5.22.1-9ubuntu0.6) ...
19-Feb-2019 16:44:16 update-alternatives: using /usr/bin/prename to provide /usr/bin/rename (rename) in auto mode
19-Feb-2019 16:44:16 Setting up libmpfr4:amd64 (3.1.4-1) ...
19-Feb-2019 16:44:17 Setting up libmpc3:amd64 (1.0.3-1) ...
19-Feb-2019 16:44:17 Setting up bzip2 (1.0.6-8) ...
19-Feb-2019 16:44:17 Setting up iproute2 (4.3.0-1ubuntu3.16.04.4) ...
19-Feb-2019 16:44:17 Setting up ifupdown (0.8.10ubuntu1.4) ...
19-Feb-2019 16:44:18 Creating /etc/network/interfaces.
19-Feb-2019 16:44:18 Setting up libisc-export160 (1:9.10.3.dfsg.P4-8ubuntu1.11) ...
19-Feb-2019 16:44:19 Setting up libdns-export162 (1:9.10.3.dfsg.P4-8ubuntu1.11) ...
19-Feb-2019 16:44:19 Setting up isc-dhcp-client (4.3.3-5ubuntu12.10) ...
19-Feb-2019 16:44:19 Setting up isc-dhcp-common (4.3.3-5ubuntu12.10) ...
19-Feb-2019 16:44:19 Setting up libxtables11:amd64 (1.6.0-2ubuntu3) ...
19-Feb-2019 16:44:19 Setting up net-tools (1.60-26ubuntu1) ...
19-Feb-2019 16:44:19 Setting up netbase (5.3) ...
19-Feb-2019 16:44:20 Setting up manpages (4.04-2) ...
19-Feb-2019 16:44:20 Setting up binutils (2.26.1-1ubuntu1~16.04.7) ...
19-Feb-2019 16:44:20 Setting up libc-dev-bin (2.23-0ubuntu10) ...
19-Feb-2019 16:44:20 Setting up linux-libc-dev:amd64 (4.4.0-142.168) ...
19-Feb-2019 16:44:20 Setting up libc6-dev:amd64 (2.23-0ubuntu10) ...
19-Feb-2019 16:44:20 Setting up libisl15:amd64 (0.16.1-1) ...
19-Feb-2019 16:44:20 Setting up cpp-5 (5.4.0-6ubuntu1~16.04.11) ...
19-Feb-2019 16:44:21 Setting up cpp (4:5.3.1-1ubuntu1) ...
19-Feb-2019 16:44:21 Setting up libcc1-0:amd64 (5.4.0-6ubuntu1~16.04.11) ...
19-Feb-2019 16:44:22 Setting up libgomp1:amd64 (5.4.0-6ubuntu1~16.04.11) ...
19-Feb-2019 16:44:22 Setting up libitm1:amd64 (5.4.0-6ubuntu1~16.04.11) ...
19-Feb-2019 16:44:22 Setting up libatomic1:amd64 (5.4.0-6ubuntu1~16.04.11) ...
19-Feb-2019 16:44:22 Setting up libasan2:amd64 (5.4.0-6ubuntu1~16.04.11) ...
19-Feb-2019 16:44:22 Setting up liblsan0:amd64 (5.4.0-6ubuntu1~16.04.11) ...
19-Feb-2019 16:44:22 Setting up libtsan0:amd64 (5.4.0-6ubuntu1~16.04.11) ...
19-Feb-2019 16:44:22 Setting up libubsan0:amd64 (5.4.0-6ubuntu1~16.04.11) ...
19-Feb-2019 16:44:22 Setting up libcilkrts5:amd64 (5.4.0-6ubuntu1~16.04.11) ...
19-Feb-2019 16:44:23 Setting up libmpx0:amd64 (5.4.0-6ubuntu1~16.04.11) ...
19-Feb-2019 16:44:23 Setting up libquadmath0:amd64 (5.4.0-6ubuntu1~16.04.11) ...
19-Feb-2019 16:44:23 Setting up libgcc-5-dev:amd64 (5.4.0-6ubuntu1~16.04.11) ...
19-Feb-2019 16:44:23 Setting up gcc-5 (5.4.0-6ubuntu1~16.04.11) ...
19-Feb-2019 16:44:23 Setting up gcc (4:5.3.1-1ubuntu1) ...
19-Feb-2019 16:44:23 Setting up libstdc++-5-dev:amd64 (5.4.0-6ubuntu1~16.04.11) ...
19-Feb-2019 16:44:23 Setting up g++-5 (5.4.0-6ubuntu1~16.04.11) ...
19-Feb-2019 16:44:24 Setting up g++ (4:5.3.1-1ubuntu1) ...
19-Feb-2019 16:44:24 update-alternatives: using /usr/bin/g++ to provide /usr/bin/c++ (c++) in auto mode
19-Feb-2019 16:44:24 Setting up make (4.1-6) ...
19-Feb-2019 16:44:24 Setting up libdpkg-perl (1.18.4ubuntu1.5) ...
19-Feb-2019 16:44:24 Setting up xz-utils (5.1.1alpha+20120614-2ubuntu2) ...
19-Feb-2019 16:44:24 update-alternatives: using /usr/bin/xz to provide /usr/bin/lzma (lzma) in auto mode
19-Feb-2019 16:44:25 Setting up patch (2.7.5-1ubuntu0.16.04.1) ...
19-Feb-2019 16:44:25 Setting up dpkg-dev (1.18.4ubuntu1.5) ...
19-Feb-2019 16:44:25 Setting up build-essential (12.1ubuntu2) ...
19-Feb-2019 16:44:27 Setting up libfakeroot:amd64 (1.20.2-1ubuntu1) ...
19-Feb-2019 16:44:27 Setting up fakeroot (1.20.2-1ubuntu1) ...
19-Feb-2019 16:44:27 update-alternatives: using /usr/bin/fakeroot-sysv to provide /usr/bin/fakeroot (fakeroot) in auto mode
19-Feb-2019 16:44:28 Setting up iproute (1:4.3.0-1ubuntu3.16.04.4) ...
19-Feb-2019 16:44:28 Setting up libalgorithm-diff-perl (1.19.03-1) ...
19-Feb-2019 16:44:28 Setting up libalgorithm-diff-xs-perl (0.04-4build1) ...
19-Feb-2019 16:44:28 Setting up libalgorithm-merge-perl (0.08-3) ...
19-Feb-2019 16:44:29 Setting up libexpat1-dev:amd64 (2.1.0-7ubuntu0.16.04.3) ...
19-Feb-2019 16:44:29 Setting up libfile-fcntllock-perl (0.22-3) ...
19-Feb-2019 16:44:29 Setting up libpython3.5:amd64 (3.5.2-2ubuntu0~16.04.5) ...
19-Feb-2019 16:44:30 Setting up libpython3.5-dev:amd64 (3.5.2-2ubuntu0~16.04.5) ...
19-Feb-2019 16:44:30 Setting up libpython3-dev:amd64 (3.5.1-3) ...
19-Feb-2019 16:44:30 Setting up manpages-dev (4.04-2) ...
19-Feb-2019 16:44:30 Setting up mongodb-org-shell (3.2.22) ...
19-Feb-2019 16:44:30 Setting up mongodb-org-server (3.2.22) ...
19-Feb-2019 16:44:30 Adding system user `mongodb' (UID 105) ...
19-Feb-2019 16:44:30 Adding new user `mongodb' (UID 105) with group `nogroup' ...
19-Feb-2019 16:44:31 Not creating home directory `/home/mongodb'.
19-Feb-2019 16:44:31 Adding group `mongodb' (GID 107) ...
19-Feb-2019 16:44:31 Done.
19-Feb-2019 16:44:31 Adding user `mongodb' to group `mongodb' ...
19-Feb-2019 16:44:31 Adding user mongodb to group mongodb
19-Feb-2019 16:44:31 Done.
19-Feb-2019 16:44:31 Setting up mongodb-org-mongos (3.2.22) ...
19-Feb-2019 16:44:31 Setting up mongodb-org-tools (3.2.22) ...
19-Feb-2019 16:44:32 Setting up mongodb-org (3.2.22) ...
19-Feb-2019 16:44:32 Setting up python-pip-whl (8.1.1-2ubuntu0.4) ...
19-Feb-2019 16:44:32 Setting up python3.5-dev (3.5.2-2ubuntu0~16.04.5) ...
19-Feb-2019 16:44:33 Setting up python3-dev (3.5.1-3) ...
19-Feb-2019 16:44:33 Setting up python3-pip (8.1.1-2ubuntu0.4) ...
19-Feb-2019 16:44:34 Setting up python3-pkg-resources (20.7.0-1) ...
19-Feb-2019 16:44:34 Setting up python3-setuptools (20.7.0-1) ...
19-Feb-2019 16:44:35 Setting up python3-wheel (0.29.0-1) ...
19-Feb-2019 16:44:35 Setting up rename (0.20-4) ...
19-Feb-2019 16:44:35 update-alternatives: using /usr/bin/file-rename to provide /usr/bin/rename (rename) in auto mode
19-Feb-2019 16:44:36 Processing triggers for libc-bin (2.23-0ubuntu10) ...
19-Feb-2019 16:44:36 Processing triggers for systemd (229-4ubuntu21.15) ...
19-Feb-2019 16:44:38 Collecting passlib
19-Feb-2019 16:44:38   Downloading https://files.pythonhosted.org/packages/ee/a7/d6d238d927df355d4e4e000670342ca4705a72f0bf694027cf67d9bcf5af/passlib-1.7.1-py2.py3-none-any.whl (498kB)
19-Feb-2019 16:44:38 Collecting bcrypt
19-Feb-2019 16:44:38   Downloading https://files.pythonhosted.org/packages/ce/3a/3d540b9f5ee8d92ce757eebacf167b9deedb8e30aedec69a2a072b2399bb/bcrypt-3.1.6.tar.gz (42kB)
19-Feb-2019 16:44:38 Collecting cffi>=1.1 (from bcrypt)
19-Feb-2019 16:44:38   Downloading https://files.pythonhosted.org/packages/16/7c/06992c4b200629d0287d3cb1b0fa56c27a3cb1f00ad99daae29dde2d519a/cffi-1.12.1-cp35-cp35m-manylinux1_x86_64.whl (427kB)
19-Feb-2019 16:44:38 Collecting six>=1.4.1 (from bcrypt)
19-Feb-2019 16:44:38   Downloading https://files.pythonhosted.org/packages/73/fb/00a976f728d0d1fecfe898238ce23f502a721c0ac0ecfedb80e0d88c64e9/six-1.12.0-py2.py3-none-any.whl
19-Feb-2019 16:44:38 Collecting pycparser (from cffi>=1.1->bcrypt)
19-Feb-2019 16:44:39   Downloading https://files.pythonhosted.org/packages/68/9e/49196946aee219aead1290e00d1e7fdeab8567783e83e1b9ab5585e6206a/pycparser-2.19.tar.gz (158kB)
19-Feb-2019 16:44:39 Building wheels for collected packages: bcrypt, pycparser
19-Feb-2019 16:44:39   Running setup.py bdist_wheel for bcrypt: started
19-Feb-2019 16:44:40   Running setup.py bdist_wheel for bcrypt: finished with status 'error'
19-Feb-2019 16:44:40   Complete output from command /usr/bin/python3 -u -c "import setuptools, tokenize;__file__='/tmp/pip-build-mrxxjhsb/bcrypt/setup.py';exec(compile(getattr(tokenize, 'open', open)(__file__).read().replace('\r\n', '\n'), __file__, 'exec'))" bdist_wheel -d /tmp/tmped0z5j97pip-wheel- --python-tag cp35:
19-Feb-2019 16:44:40   c/_cffi_backend.c:15:17: fatal error: ffi.h: No such file or directory
19-Feb-2019 16:44:40   compilation terminated.
19-Feb-2019 16:44:40   Traceback (most recent call last):
19-Feb-2019 16:44:40     File "/usr/lib/python3.5/distutils/unixccompiler.py", line 118, in _compile
19-Feb-2019 16:44:40       extra_postargs)
19-Feb-2019 16:44:40     File "/usr/lib/python3.5/distutils/ccompiler.py", line 909, in spawn
19-Feb-2019 16:44:40       spawn(cmd, dry_run=self.dry_run)
19-Feb-2019 16:44:40     File "/usr/lib/python3.5/distutils/spawn.py", line 36, in spawn
19-Feb-2019 16:44:40       _spawn_posix(cmd, search_path, dry_run=dry_run)
19-Feb-2019 16:44:40     File "/usr/lib/python3.5/distutils/spawn.py", line 159, in _spawn_posix
19-Feb-2019 16:44:40       % (cmd, exit_status))
19-Feb-2019 16:44:40   distutils.errors.DistutilsExecError: command 'x86_64-linux-gnu-gcc' failed with exit status 1
19-Feb-2019 16:44:40  
19-Feb-2019 16:44:40   During handling of the above exception, another exception occurred:
19-Feb-2019 16:44:40  
19-Feb-2019 16:44:40   Traceback (most recent call last):
19-Feb-2019 16:44:40     File "/usr/lib/python3.5/distutils/core.py", line 148, in setup
19-Feb-2019 16:44:40       dist.run_commands()
19-Feb-2019 16:44:40     File "/usr/lib/python3.5/distutils/dist.py", line 955, in run_commands
19-Feb-2019 16:44:40       self.run_command(cmd)
19-Feb-2019 16:44:40     File "/usr/lib/python3.5/distutils/dist.py", line 974, in run_command
19-Feb-2019 16:44:40       cmd_obj.run()
19-Feb-2019 16:44:40     File "/usr/lib/python3/dist-packages/setuptools/command/bdist_egg.py", line 161, in run
19-Feb-2019 16:44:40       cmd = self.call_command('install_lib', warn_dir=0)
19-Feb-2019 16:44:40     File "/usr/lib/python3/dist-packages/setuptools/command/bdist_egg.py", line 147, in call_command
19-Feb-2019 16:44:40       self.run_command(cmdname)
19-Feb-2019 16:44:40     File "/usr/lib/python3.5/distutils/cmd.py", line 313, in run_command
19-Feb-2019 16:44:40       self.distribution.run_command(command)
19-Feb-2019 16:44:40     File "/usr/lib/python3.5/distutils/dist.py", line 974, in run_command
19-Feb-2019 16:44:40       cmd_obj.run()
19-Feb-2019 16:44:40     File "/usr/lib/python3/dist-packages/setuptools/command/install_lib.py", line 23, in run
19-Feb-2019 16:44:40       self.build()
19-Feb-2019 16:44:40     File "/usr/lib/python3.5/distutils/command/install_lib.py", line 109, in build
19-Feb-2019 16:44:40       self.run_command('build_ext')
19-Feb-2019 16:44:40     File "/usr/lib/python3.5/distutils/cmd.py", line 313, in run_command
19-Feb-2019 16:44:40       self.distribution.run_command(command)
19-Feb-2019 16:44:40     File "/usr/lib/python3.5/distutils/dist.py", line 974, in run_command
19-Feb-2019 16:44:40       cmd_obj.run()
19-Feb-2019 16:44:40     File "/usr/lib/python3/dist-packages/setuptools/command/build_ext.py", line 49, in run
19-Feb-2019 16:44:40       _build_ext.run(self)
19-Feb-2019 16:44:40     File "/usr/lib/python3.5/distutils/command/build_ext.py", line 338, in run
19-Feb-2019 16:44:40       self.build_extensions()
19-Feb-2019 16:44:40     File "/usr/lib/python3.5/distutils/command/build_ext.py", line 447, in build_extensions
19-Feb-2019 16:44:40       self._build_extensions_serial()
19-Feb-2019 16:44:40     File "/usr/lib/python3.5/distutils/command/build_ext.py", line 472, in _build_extensions_serial
19-Feb-2019 16:44:40       self.build_extension(ext)
19-Feb-2019 16:44:40     File "/usr/lib/python3/dist-packages/setuptools/command/build_ext.py", line 174, in build_extension
19-Feb-2019 16:44:40       _build_ext.build_extension(self, ext)
19-Feb-2019 16:44:40     File "/usr/lib/python3.5/distutils/command/build_ext.py", line 532, in build_extension
19-Feb-2019 16:44:40       depends=ext.depends)
19-Feb-2019 16:44:40     File "/usr/lib/python3.5/distutils/ccompiler.py", line 574, in compile
19-Feb-2019 16:44:40       self._compile(obj, src, ext, cc_args, extra_postargs, pp_opts)
19-Feb-2019 16:44:40     File "/usr/lib/python3.5/distutils/unixccompiler.py", line 120, in _compile
19-Feb-2019 16:44:40       raise CompileError(msg)
19-Feb-2019 16:44:40   distutils.errors.CompileError: command 'x86_64-linux-gnu-gcc' failed with exit status 1
19-Feb-2019 16:44:40  
19-Feb-2019 16:44:40   During handling of the above exception, another exception occurred:
19-Feb-2019 16:44:40  
19-Feb-2019 16:44:40   Traceback (most recent call last):
19-Feb-2019 16:44:40     File "/usr/lib/python3/dist-packages/setuptools/sandbox.py", line 154, in save_modules
19-Feb-2019 16:44:40       yield saved
19-Feb-2019 16:44:40     File "/usr/lib/python3/dist-packages/setuptools/sandbox.py", line 195, in setup_context
19-Feb-2019 16:44:40       yield
19-Feb-2019 16:44:40     File "/usr/lib/python3/dist-packages/setuptools/sandbox.py", line 243, in run_setup
19-Feb-2019 16:44:40       DirectorySandbox(setup_dir).run(runner)
19-Feb-2019 16:44:40     File "/usr/lib/python3/dist-packages/setuptools/sandbox.py", line 273, in run
19-Feb-2019 16:44:40       return func()
19-Feb-2019 16:44:40     File "/usr/lib/python3/dist-packages/setuptools/sandbox.py", line 242, in runner
19-Feb-2019 16:44:40       _execfile(setup_script, ns)
19-Feb-2019 16:44:40     File "/usr/lib/python3/dist-packages/setuptools/sandbox.py", line 46, in _execfile
19-Feb-2019 16:44:40       exec(code, globals, locals)
19-Feb-2019 16:44:40     File "/tmp/easy_install-s99d42fm/cffi-1.12.1/setup.py", line 248, in <module>
19-Feb-2019 16:44:40     File "/usr/lib/python3.5/distutils/core.py", line 163, in setup
19-Feb-2019 16:44:40       raise SystemExit("error: " + str(msg))
19-Feb-2019 16:44:40   SystemExit: error: command 'x86_64-linux-gnu-gcc' failed with exit status 1
19-Feb-2019 16:44:40  
19-Feb-2019 16:44:40   During handling of the above exception, another exception occurred:
19-Feb-2019 16:44:40  
19-Feb-2019 16:44:40   Traceback (most recent call last):
19-Feb-2019 16:44:40     File "/usr/lib/python3/dist-packages/setuptools/command/easy_install.py", line 1087, in run_setup
19-Feb-2019 16:44:40       run_setup(setup_script, args)
19-Feb-2019 16:44:40     File "/usr/lib/python3/dist-packages/setuptools/sandbox.py", line 246, in run_setup
19-Feb-2019 16:44:40       raise
19-Feb-2019 16:44:40     File "/usr/lib/python3.5/contextlib.py", line 77, in __exit__
19-Feb-2019 16:44:40       self.gen.throw(type, value, traceback)
19-Feb-2019 16:44:40     File "/usr/lib/python3/dist-packages/setuptools/sandbox.py", line 195, in setup_context
19-Feb-2019 16:44:40       yield
19-Feb-2019 16:44:40     File "/usr/lib/python3.5/contextlib.py", line 77, in __exit__
19-Feb-2019 16:44:40       self.gen.throw(type, value, traceback)
19-Feb-2019 16:44:40     File "/usr/lib/python3/dist-packages/setuptools/sandbox.py", line 166, in save_modules
19-Feb-2019 16:44:40       saved_exc.resume()
19-Feb-2019 16:44:40     File "/usr/lib/python3/dist-packages/setuptools/sandbox.py", line 141, in resume
19-Feb-2019 16:44:40       six.reraise(type, exc, self._tb)
19-Feb-2019 16:44:40     File "/usr/lib/python3/dist-packages/pkg_resources/_vendor/six.py", line 685, in reraise
19-Feb-2019 16:44:40       raise value.with_traceback(tb)
19-Feb-2019 16:44:40     File "/usr/lib/python3/dist-packages/setuptools/sandbox.py", line 154, in save_modules
19-Feb-2019 16:44:40       yield saved
19-Feb-2019 16:44:40     File "/usr/lib/python3/dist-packages/setuptools/sandbox.py", line 195, in setup_context
19-Feb-2019 16:44:40       yield
19-Feb-2019 16:44:40     File "/usr/lib/python3/dist-packages/setuptools/sandbox.py", line 243, in run_setup
19-Feb-2019 16:44:40       DirectorySandbox(setup_dir).run(runner)
19-Feb-2019 16:44:40     File "/usr/lib/python3/dist-packages/setuptools/sandbox.py", line 273, in run
19-Feb-2019 16:44:40       return func()
19-Feb-2019 16:44:40     File "/usr/lib/python3/dist-packages/setuptools/sandbox.py", line 242, in runner
19-Feb-2019 16:44:40       _execfile(setup_script, ns)
19-Feb-2019 16:44:40     File "/usr/lib/python3/dist-packages/setuptools/sandbox.py", line 46, in _execfile
19-Feb-2019 16:44:40       exec(code, globals, locals)
19-Feb-2019 16:44:40     File "/tmp/easy_install-s99d42fm/cffi-1.12.1/setup.py", line 248, in <module>
19-Feb-2019 16:44:40     File "/usr/lib/python3.5/distutils/core.py", line 163, in setup
19-Feb-2019 16:44:40       raise SystemExit("error: " + str(msg))
19-Feb-2019 16:44:40   SystemExit: error: command 'x86_64-linux-gnu-gcc' failed with exit status 1
19-Feb-2019 16:44:40  
19-Feb-2019 16:44:40   During handling of the above exception, another exception occurred:
19-Feb-2019 16:44:40  
19-Feb-2019 16:44:40   Traceback (most recent call last):
19-Feb-2019 16:44:40     File "<string>", line 1, in <module>
19-Feb-2019 16:44:40     File "/tmp/pip-build-mrxxjhsb/bcrypt/setup.py", line 240, in <module>
19-Feb-2019 16:44:40       **keywords_with_side_effects(sys.argv)
19-Feb-2019 16:44:40     File "/usr/lib/python3.5/distutils/core.py", line 108, in setup
19-Feb-2019 16:44:40       _setup_distribution = dist = klass(attrs)
19-Feb-2019 16:44:40     File "/usr/lib/python3/dist-packages/setuptools/dist.py", line 269, in __init__
19-Feb-2019 16:44:40       self.fetch_build_eggs(attrs['setup_requires'])
19-Feb-2019 16:44:40     File "/usr/lib/python3/dist-packages/setuptools/dist.py", line 313, in fetch_build_eggs
19-Feb-2019 16:44:40       replace_conflicting=True,
19-Feb-2019 16:44:40     File "/usr/lib/python3/dist-packages/pkg_resources/__init__.py", line 826, in resolve
19-Feb-2019 16:44:40       dist = best[req.key] = env.best_match(req, ws, installer)
19-Feb-2019 16:44:40     File "/usr/lib/python3/dist-packages/pkg_resources/__init__.py", line 1092, in best_match
19-Feb-2019 16:44:40       return self.obtain(req, installer)
19-Feb-2019 16:44:40     File "/usr/lib/python3/dist-packages/pkg_resources/__init__.py", line 1104, in obtain
19-Feb-2019 16:44:40       return installer(requirement)
19-Feb-2019 16:44:40     File "/usr/lib/python3/dist-packages/setuptools/dist.py", line 380, in fetch_build_egg
19-Feb-2019 16:44:40       return cmd.easy_install(req)
19-Feb-2019 16:44:40     File "/usr/lib/python3/dist-packages/setuptools/command/easy_install.py", line 663, in easy_install
19-Feb-2019 16:44:40       return self.install_item(spec, dist.location, tmpdir, deps)
19-Feb-2019 16:44:40     File "/usr/lib/python3/dist-packages/setuptools/command/easy_install.py", line 693, in install_item
19-Feb-2019 16:44:40       dists = self.install_eggs(spec, download, tmpdir)
19-Feb-2019 16:44:40     File "/usr/lib/python3/dist-packages/setuptools/command/easy_install.py", line 873, in install_eggs
19-Feb-2019 16:44:40       return self.build_and_install(setup_script, setup_base)
19-Feb-2019 16:44:40     File "/usr/lib/python3/dist-packages/setuptools/command/easy_install.py", line 1101, in build_and_install
19-Feb-2019 16:44:40       self.run_setup(setup_script, setup_base, args)
19-Feb-2019 16:44:40     File "/usr/lib/python3/dist-packages/setuptools/command/easy_install.py", line 1089, in run_setup
19-Feb-2019 16:44:40       raise DistutilsError("Setup script exited with %s" % (v.args[0],))
19-Feb-2019 16:44:40   distutils.errors.DistutilsError: Setup script exited with error: command 'x86_64-linux-gnu-gcc' failed with exit status 1
19-Feb-2019 16:44:40  
19-Feb-2019 16:44:40   ----------------------------------------
19-Feb-2019 16:44:40   Failed building wheel for bcrypt
19-Feb-2019 16:44:40   Running setup.py clean for bcrypt
19-Feb-2019 16:44:41   Complete output from command /usr/bin/python3 -u -c "import setuptools, tokenize;__file__='/tmp/pip-build-mrxxjhsb/bcrypt/setup.py';exec(compile(getattr(tokenize, 'open', open)(__file__).read().replace('\r\n', '\n'), __file__, 'exec'))" clean --all:
19-Feb-2019 16:44:41   c/_cffi_backend.c:15:17: fatal error: ffi.h: No such file or directory
19-Feb-2019 16:44:41   compilation terminated.
19-Feb-2019 16:44:41   Traceback (most recent call last):
19-Feb-2019 16:44:41     File "/usr/lib/python3.5/distutils/unixccompiler.py", line 118, in _compile
19-Feb-2019 16:44:41       extra_postargs)
19-Feb-2019 16:44:41     File "/usr/lib/python3.5/distutils/ccompiler.py", line 909, in spawn
19-Feb-2019 16:44:41       spawn(cmd, dry_run=self.dry_run)
19-Feb-2019 16:44:41     File "/usr/lib/python3.5/distutils/spawn.py", line 36, in spawn
19-Feb-2019 16:44:41       _spawn_posix(cmd, search_path, dry_run=dry_run)
19-Feb-2019 16:44:41     File "/usr/lib/python3.5/distutils/spawn.py", line 159, in _spawn_posix
19-Feb-2019 16:44:41       % (cmd, exit_status))
19-Feb-2019 16:44:41   distutils.errors.DistutilsExecError: command 'x86_64-linux-gnu-gcc' failed with exit status 1
19-Feb-2019 16:44:41  
19-Feb-2019 16:44:41   During handling of the above exception, another exception occurred:
19-Feb-2019 16:44:41  
19-Feb-2019 16:44:41   Traceback (most recent call last):
19-Feb-2019 16:44:41     File "/usr/lib/python3.5/distutils/core.py", line 148, in setup
19-Feb-2019 16:44:41       dist.run_commands()
19-Feb-2019 16:44:41     File "/usr/lib/python3.5/distutils/dist.py", line 955, in run_commands
19-Feb-2019 16:44:41       self.run_command(cmd)
19-Feb-2019 16:44:41     File "/usr/lib/python3.5/distutils/dist.py", line 974, in run_command
19-Feb-2019 16:44:41       cmd_obj.run()
19-Feb-2019 16:44:41     File "/usr/lib/python3/dist-packages/setuptools/command/bdist_egg.py", line 161, in run
19-Feb-2019 16:44:41       cmd = self.call_command('install_lib', warn_dir=0)
19-Feb-2019 16:44:41     File "/usr/lib/python3/dist-packages/setuptools/command/bdist_egg.py", line 147, in call_command
19-Feb-2019 16:44:41       self.run_command(cmdname)
19-Feb-2019 16:44:41     File "/usr/lib/python3.5/distutils/cmd.py", line 313, in run_command
19-Feb-2019 16:44:41       self.distribution.run_command(command)
19-Feb-2019 16:44:41     File "/usr/lib/python3.5/distutils/dist.py", line 974, in run_command
19-Feb-2019 16:44:41       cmd_obj.run()
19-Feb-2019 16:44:41     File "/usr/lib/python3/dist-packages/setuptools/command/install_lib.py", line 23, in run
19-Feb-2019 16:44:41       self.build()
19-Feb-2019 16:44:41     File "/usr/lib/python3.5/distutils/command/install_lib.py", line 109, in build
19-Feb-2019 16:44:41       self.run_command('build_ext')
19-Feb-2019 16:44:41     File "/usr/lib/python3.5/distutils/cmd.py", line 313, in run_command
19-Feb-2019 16:44:41       self.distribution.run_command(command)
19-Feb-2019 16:44:41     File "/usr/lib/python3.5/distutils/dist.py", line 974, in run_command
19-Feb-2019 16:44:41       cmd_obj.run()
19-Feb-2019 16:44:41     File "/usr/lib/python3/dist-packages/setuptools/command/build_ext.py", line 49, in run
19-Feb-2019 16:44:41       _build_ext.run(self)
19-Feb-2019 16:44:41     File "/usr/lib/python3.5/distutils/command/build_ext.py", line 338, in run
19-Feb-2019 16:44:41       self.build_extensions()
19-Feb-2019 16:44:41     File "/usr/lib/python3.5/distutils/command/build_ext.py", line 447, in build_extensions
19-Feb-2019 16:44:41       self._build_extensions_serial()
19-Feb-2019 16:44:41     File "/usr/lib/python3.5/distutils/command/build_ext.py", line 472, in _build_extensions_serial
19-Feb-2019 16:44:41       self.build_extension(ext)
19-Feb-2019 16:44:41     File "/usr/lib/python3/dist-packages/setuptools/command/build_ext.py", line 174, in build_extension
19-Feb-2019 16:44:41       _build_ext.build_extension(self, ext)
19-Feb-2019 16:44:41     File "/usr/lib/python3.5/distutils/command/build_ext.py", line 532, in build_extension
19-Feb-2019 16:44:41       depends=ext.depends)
19-Feb-2019 16:44:41     File "/usr/lib/python3.5/distutils/ccompiler.py", line 574, in compile
19-Feb-2019 16:44:41       self._compile(obj, src, ext, cc_args, extra_postargs, pp_opts)
19-Feb-2019 16:44:41     File "/usr/lib/python3.5/distutils/unixccompiler.py", line 120, in _compile
19-Feb-2019 16:44:41       raise CompileError(msg)
19-Feb-2019 16:44:41   distutils.errors.CompileError: command 'x86_64-linux-gnu-gcc' failed with exit status 1
19-Feb-2019 16:44:41  
19-Feb-2019 16:44:41   During handling of the above exception, another exception occurred:
19-Feb-2019 16:44:41  
19-Feb-2019 16:44:41   Traceback (most recent call last):
19-Feb-2019 16:44:41     File "/usr/lib/python3/dist-packages/setuptools/sandbox.py", line 154, in save_modules
19-Feb-2019 16:44:41       yield saved
19-Feb-2019 16:44:41     File "/usr/lib/python3/dist-packages/setuptools/sandbox.py", line 195, in setup_context
19-Feb-2019 16:44:41       yield
19-Feb-2019 16:44:41     File "/usr/lib/python3/dist-packages/setuptools/sandbox.py", line 243, in run_setup
19-Feb-2019 16:44:41       DirectorySandbox(setup_dir).run(runner)
19-Feb-2019 16:44:41     File "/usr/lib/python3/dist-packages/setuptools/sandbox.py", line 273, in run
19-Feb-2019 16:44:41       return func()
19-Feb-2019 16:44:41     File "/usr/lib/python3/dist-packages/setuptools/sandbox.py", line 242, in runner
19-Feb-2019 16:44:41       _execfile(setup_script, ns)
19-Feb-2019 16:44:41     File "/usr/lib/python3/dist-packages/setuptools/sandbox.py", line 46, in _execfile
19-Feb-2019 16:44:41       exec(code, globals, locals)
19-Feb-2019 16:44:41     File "/tmp/easy_install-250c1jxj/cffi-1.12.1/setup.py", line 248, in <module>
19-Feb-2019 16:44:41     File "/usr/lib/python3.5/distutils/core.py", line 163, in setup
19-Feb-2019 16:44:41       raise SystemExit("error: " + str(msg))
19-Feb-2019 16:44:41   SystemExit: error: command 'x86_64-linux-gnu-gcc' failed with exit status 1
19-Feb-2019 16:44:41  
19-Feb-2019 16:44:41   During handling of the above exception, another exception occurred:
19-Feb-2019 16:44:41  
19-Feb-2019 16:44:41   Traceback (most recent call last):
19-Feb-2019 16:44:41     File "/usr/lib/python3/dist-packages/setuptools/command/easy_install.py", line 1087, in run_setup
19-Feb-2019 16:44:41       run_setup(setup_script, args)
19-Feb-2019 16:44:41     File "/usr/lib/python3/dist-packages/setuptools/sandbox.py", line 246, in run_setup
19-Feb-2019 16:44:41       raise
19-Feb-2019 16:44:41     File "/usr/lib/python3.5/contextlib.py", line 77, in __exit__
19-Feb-2019 16:44:41       self.gen.throw(type, value, traceback)
19-Feb-2019 16:44:41     File "/usr/lib/python3/dist-packages/setuptools/sandbox.py", line 195, in setup_context
19-Feb-2019 16:44:41       yield
19-Feb-2019 16:44:41     File "/usr/lib/python3.5/contextlib.py", line 77, in __exit__
19-Feb-2019 16:44:41       self.gen.throw(type, value, traceback)
19-Feb-2019 16:44:41     File "/usr/lib/python3/dist-packages/setuptools/sandbox.py", line 166, in save_modules
19-Feb-2019 16:44:41       saved_exc.resume()
19-Feb-2019 16:44:41     File "/usr/lib/python3/dist-packages/setuptools/sandbox.py", line 141, in resume
19-Feb-2019 16:44:41       six.reraise(type, exc, self._tb)
19-Feb-2019 16:44:41     File "/usr/lib/python3/dist-packages/pkg_resources/_vendor/six.py", line 685, in reraise
19-Feb-2019 16:44:41       raise value.with_traceback(tb)
19-Feb-2019 16:44:41     File "/usr/lib/python3/dist-packages/setuptools/sandbox.py", line 154, in save_modules
19-Feb-2019 16:44:41       yield saved
19-Feb-2019 16:44:41     File "/usr/lib/python3/dist-packages/setuptools/sandbox.py", line 195, in setup_context
19-Feb-2019 16:44:41       yield
19-Feb-2019 16:44:41     File "/usr/lib/python3/dist-packages/setuptools/sandbox.py", line 243, in run_setup
19-Feb-2019 16:44:41       DirectorySandbox(setup_dir).run(runner)
19-Feb-2019 16:44:41     File "/usr/lib/python3/dist-packages/setuptools/sandbox.py", line 273, in run
19-Feb-2019 16:44:41       return func()
19-Feb-2019 16:44:41     File "/usr/lib/python3/dist-packages/setuptools/sandbox.py", line 242, in runner
19-Feb-2019 16:44:41       _execfile(setup_script, ns)
19-Feb-2019 16:44:41     File "/usr/lib/python3/dist-packages/setuptools/sandbox.py", line 46, in _execfile
19-Feb-2019 16:44:41       exec(code, globals, locals)
19-Feb-2019 16:44:41     File "/tmp/easy_install-250c1jxj/cffi-1.12.1/setup.py", line 248, in <module>
19-Feb-2019 16:44:41     File "/usr/lib/python3.5/distutils/core.py", line 163, in setup
19-Feb-2019 16:44:41       raise SystemExit("error: " + str(msg))
19-Feb-2019 16:44:41   SystemExit: error: command 'x86_64-linux-gnu-gcc' failed with exit status 1
19-Feb-2019 16:44:41  
19-Feb-2019 16:44:41   During handling of the above exception, another exception occurred:
19-Feb-2019 16:44:41  
19-Feb-2019 16:44:41   Traceback (most recent call last):
19-Feb-2019 16:44:41     File "<string>", line 1, in <module>
19-Feb-2019 16:44:41     File "/tmp/pip-build-mrxxjhsb/bcrypt/setup.py", line 240, in <module>
19-Feb-2019 16:44:41       **keywords_with_side_effects(sys.argv)
19-Feb-2019 16:44:41     File "/usr/lib/python3.5/distutils/core.py", line 108, in setup
19-Feb-2019 16:44:41       _setup_distribution = dist = klass(attrs)
19-Feb-2019 16:44:41     File "/usr/lib/python3/dist-packages/setuptools/dist.py", line 269, in __init__
19-Feb-2019 16:44:41       self.fetch_build_eggs(attrs['setup_requires'])
19-Feb-2019 16:44:41     File "/usr/lib/python3/dist-packages/setuptools/dist.py", line 313, in fetch_build_eggs
19-Feb-2019 16:44:41       replace_conflicting=True,
19-Feb-2019 16:44:41     File "/usr/lib/python3/dist-packages/pkg_resources/__init__.py", line 826, in resolve
19-Feb-2019 16:44:41       dist = best[req.key] = env.best_match(req, ws, installer)
19-Feb-2019 16:44:41     File "/usr/lib/python3/dist-packages/pkg_resources/__init__.py", line 1092, in best_match
19-Feb-2019 16:44:41       return self.obtain(req, installer)
19-Feb-2019 16:44:41     File "/usr/lib/python3/dist-packages/pkg_resources/__init__.py", line 1104, in obtain
19-Feb-2019 16:44:41       return installer(requirement)
19-Feb-2019 16:44:41     File "/usr/lib/python3/dist-packages/setuptools/dist.py", line 380, in fetch_build_egg
19-Feb-2019 16:44:41       return cmd.easy_install(req)
19-Feb-2019 16:44:41     File "/usr/lib/python3/dist-packages/setuptools/command/easy_install.py", line 663, in easy_install
19-Feb-2019 16:44:41       return self.install_item(spec, dist.location, tmpdir, deps)
19-Feb-2019 16:44:41     File "/usr/lib/python3/dist-packages/setuptools/command/easy_install.py", line 693, in install_item
19-Feb-2019 16:44:41       dists = self.install_eggs(spec, download, tmpdir)
19-Feb-2019 16:44:41     File "/usr/lib/python3/dist-packages/setuptools/command/easy_install.py", line 873, in install_eggs
19-Feb-2019 16:44:41       return self.build_and_install(setup_script, setup_base)
19-Feb-2019 16:44:41     File "/usr/lib/python3/dist-packages/setuptools/command/easy_install.py", line 1101, in build_and_install
19-Feb-2019 16:44:41       self.run_setup(setup_script, setup_base, args)
19-Feb-2019 16:44:41     File "/usr/lib/python3/dist-packages/setuptools/command/easy_install.py", line 1089, in run_setup
19-Feb-2019 16:44:41       raise DistutilsError("Setup script exited with %s" % (v.args[0],))
19-Feb-2019 16:44:41   distutils.errors.DistutilsError: Setup script exited with error: command 'x86_64-linux-gnu-gcc' failed with exit status 1
19-Feb-2019 16:44:41  
19-Feb-2019 16:44:41   ----------------------------------------
19-Feb-2019 16:44:41   Failed cleaning build dir for bcrypt
19-Feb-2019 16:44:41   Running setup.py bdist_wheel for pycparser: started
19-Feb-2019 16:44:41   Running setup.py bdist_wheel for pycparser: finished with status 'done'
19-Feb-2019 16:44:41   Stored in directory: /root/.cache/pip/wheels/f2/9a/90/de94f8556265ddc9d9c8b271b0f63e57b26fb1d67a45564511
19-Feb-2019 16:44:41 Successfully built pycparser
19-Feb-2019 16:44:41 Failed to build bcrypt
19-Feb-2019 16:44:41 Installing collected packages: passlib, pycparser, cffi, six, bcrypt
19-Feb-2019 16:44:42   Running setup.py install for bcrypt: started
19-Feb-2019 16:44:43     Running setup.py install for bcrypt: finished with status 'done'
19-Feb-2019 16:44:43 Successfully installed bcrypt-3.1.6 cffi-1.12.1 passlib-1.7.1 pycparser-2.19 six-1.12.0
19-Feb-2019 16:44:43 You are using pip version 8.1.1, however version 19.0.2 is available.
19-Feb-2019 16:44:43 You should consider upgrading via the 'pip install --upgrade pip' command.
19-Feb-2019 16:44:51 Removing intermediate container 2f23fef3ae78
19-Feb-2019 16:44:51 ---> 71e7bd463c9c
19-Feb-2019 16:44:51 Step 5/6 : COPY FILES.mongo-init /
19-Feb-2019 16:44:51 ---> 08d8eda835e8
19-Feb-2019 16:44:51 Step 6/6 : ENTRYPOINT ["/usr/local/bin/entrypoint.sh"]
19-Feb-2019 16:44:51 ---> Running in 4c9221bdd040
19-Feb-2019 16:44:53 Removing intermediate container 4c9221bdd040
19-Feb-2019 16:44:53 ---> f6ccb401edbd
19-Feb-2019 16:44:53 Successfully built f6ccb401edbd
19-Feb-2019 16:44:53 Successfully tagged clowder/mongo-init:latest
19-Feb-2019 16:44:53 Finished task 'docker build' with result: Success
19-Feb-2019 16:44:53 Starting task 'docker push' of type 'com.atlassian.bamboo.plugins.scripttask:task.builder.script'
19-Feb-2019 16:44:53
Beginning to execute external process for build 'Clowder - CORE - hotfix-CATS-802-fix-swagger.yml - default #3 (CATS-CORE968-JOB1-3)'
... running command line:
/bin/sh release.sh
... in: /home/bamboo/bamboo-agent-home/xml-data/build-dir/CATS-CORE968-JOB1
... using extra environment variables:
bamboo_planRepository_1_branch=hotfix/CATS-802-fix-swagger.yml
bamboo_capability_system_builder_command_npm_6=/home/bamboo/node-v6.9.1/bin/npm
bamboo_capability_system_builder_command_buckminster_4_3=/home/bamboo/buckminster-4.3/buckminster
bamboo_capability_system_builder_node_Node_js_v6_9_1=/home/bamboo/node-v6.9.1/bin/node
bamboo_capability_system_builder_command_buckminster_4_4=/home/bamboo/buckminster-4.4/buckminster
bamboo_repository_166953024_branch_name=hotfix/CATS-802-fix-swagger.yml
bamboo_capability_system_builder_command_buckminster_4_2=/home/bamboo/buckminster-4.2/buckminster
bamboo_planRepository_1_branchDisplayName=hotfix/CATS-802-fix-swagger.yml
bamboo_repository_revision_number=240c37cb4309bc9d3a931ba43633dd5f0eae2bf3
bamboo_repository_166953024_revision_number=240c37cb4309bc9d3a931ba43633dd5f0eae2bf3
bamboo_resultsUrl=https://opensource.ncsa.illinois.edu/bamboo/browse/CATS-CORE968-JOB1-3
bamboo_build_commandline_com_atlassian_bamboo_plugins_scripttask_task_builder_script_15=/bin/sh /home/bamboo/bamboo-agent-home/temp/CATS-CORE968-JOB1-3-ScriptBuildTask-5999653380876770427.sh
bamboo_build_commandline_com_atlassian_bamboo_plugins_scripttask_task_builder_script_16=/bin/sh docker.sh
bamboo_capability_system_builder_command_sphinx=/usr/bin/sphinx-build
bamboo_build_working_directory=/home/bamboo/bamboo-agent-home/xml-data/build-dir/CATS-CORE968-JOB1
bamboo_planRepository_1_name=clowder
bamboo_buildKey=CATS-CORE968-JOB1
bamboo_repository_166953024_previous_revision_number=80f9ec75c0dd0264637963124df315e19ed6d292
bamboo_capability_system_os=linux
bamboo_shortPlanName=hotfix-CATS-802-fix-swagger.yml
bamboo_planRepository_name=clowder
bamboo_buildNumber=3
bamboo_capability_system_builder_node_grunt_6=/home/bamboo/node-v6.9.1/bin/grunt
bamboo_shortJobName=default
bamboo_buildResultsUrl=https://opensource.ncsa.illinois.edu/bamboo/browse/CATS-CORE968-JOB1-3
bamboo_planRepository_repositoryUrl=ssh://git@opensource.ncsa.illinois.edu:7999/cats/clowder.git
bamboo_build_commandline_com_atlassian_bamboo_plugins_sbt_sbt_18=/home/bamboo/sbt-0.13.13/bin/sbt compile
bamboo_build_commandline_com_atlassian_bamboo_plugins_sbt_sbt_19=/home/bamboo/sbt-0.13.13/bin/sbt test-only integration.APITestSuite
bamboo_build_commandline_com_atlassian_bamboo_plugins_scripttask_task_builder_script_22=/home/bamboo/bamboo-agent-home/temp/CATS-CORE968-JOB1-3-ScriptBuildTask-8018177477955658411.sh
bamboo_agentId=140673027
bamboo_build_commandline_com_atlassian_bamboo_plugins_sbt_sbt_17=/home/bamboo/sbt-0.13.13/bin/sbt clean update
bamboo_planName=Clowder - CORE - hotfix-CATS-802-fix-swagger.yml
bamboo_shortPlanKey=CORE968
bamboo_capability_system_builder_command_sbt_0_13=/home/bamboo/sbt-0.13.2/bin/sbt
bamboo_capability_system_builder_node_Node_js_v0_10_28=/home/bamboo/node-v0.10.28/bin/node
bamboo_shortJobKey=JOB1
bamboo_planRepository_revision=240c37cb4309bc9d3a931ba43633dd5f0eae2bf3
bamboo_buildTimeStamp=2019-02-19T16:23:27.087-06:00
bamboo_repository_previous_revision_number=80f9ec75c0dd0264637963124df315e19ed6d292
bamboo_capability_system_builder_command_npm=/home/bamboo/node-v0.10.28/bin/npm
bamboo_capability_system_builder_mvn2_Maven_2=/home/bamboo/apache-maven-2.2.1
bamboo_planRepository_previousRevision=80f9ec75c0dd0264637963124df315e19ed6d292
bamboo_repository_166953024_name=clowder
bamboo_repository_git_branch=hotfix/CATS-802-fix-swagger.yml
bamboo_buildResultKey=CATS-CORE968-JOB1-3
bamboo_repository_branch_name=hotfix/CATS-802-fix-swagger.yml
bamboo_buildPlanName=Clowder - CORE - hotfix-CATS-802-fix-swagger.yml - default
bamboo_planRepository_1_revision=240c37cb4309bc9d3a931ba43633dd5f0eae2bf3
bamboo_capability_system_builder_command_python3=/usr/bin/python3
bamboo_repository_name=clowder
bamboo_build_commandline_com_atlassian_bamboo_plugins_sbt_sbt_21=/home/bamboo/sbt-0.13.13/bin/sbt dist
bamboo_buildFailed=false
bamboo_build_commandline_com_atlassian_bamboo_plugins_sbt_sbt_20=/home/bamboo/sbt-0.13.13/bin/sbt doc
bamboo_capability_system_docker_executable=/usr/bin/docker
bamboo_capability_system_builder_command_grunt=/home/bamboo/node-v0.10.28/bin/grunt
bamboo_repository_166953024_git_username=
bamboo_planRepository_branch=hotfix/CATS-802-fix-swagger.yml
bamboo_agentWorkingDirectory=/home/bamboo/bamboo-agent-home/xml-data/build-dir
bamboo_capability_system_git_executable=/usr/bin/git
bamboo_repository_git_username=
bamboo_planRepository_1_previousRevision=80f9ec75c0dd0264637963124df315e19ed6d292
bamboo_capability_system_builder_sbt_SBT_0_13_13=/home/bamboo/sbt-0.13.13
bamboo_planRepository_branchDisplayName=hotfix/CATS-802-fix-swagger.yml
bamboo_repository_166953024_git_branch=hotfix/CATS-802-fix-swagger.yml
bamboo_capability_system_builder_command_phantomjs=/home/bamboo/phantomjs-1.9.8/bin/phantomjs
bamboo_planRepository_1_type=bbserver
bamboo_planRepository_branchName=hotfix/CATS-802-fix-swagger.yml
bamboo_capability_system_builder_command_python2_7=/usr/bin/python2.7
bamboo_capability_system_hostname=buildserver-1
bamboo_capability_system_jdk_JDK=/home/bamboo/jdk1.8.0_66
bamboo_capability_system_software_mongo=/usr/bin/mongo
bamboo_repository_166953024_git_repositoryUrl=ssh://git@opensource.ncsa.illinois.edu:7999/cats/clowder.git
bamboo_plan_storageTag=plan-166756479
bamboo_hg_cache_directory=/home/bamboo/bamboo-agent-home/xml-data/build-dir/_hg-repositories-cache
bamboo_capability_system_builder_command_casperjs=/home/bamboo/node-v0.10.28/bin/casperjs
bamboo_capability_system_software_rabbitmq=/usr/sbin/rabbitmqctl
bamboo_capability_system_jdk_JDK_1_8_0_66=/home/bamboo/jdk1.8.0_66
bamboo_planRepository_1_username=
bamboo_planRepository_type=bbserver
bamboo_git_cache_directory=/home/bamboo/bamboo-agent-home/xml-data/build-dir/_git-repositories-cache
bamboo_repository_git_repositoryUrl=ssh://git@opensource.ncsa.illinois.edu:7999/cats/clowder.git
bamboo_capability_system_builder_node_Node_js=/home/bamboo/node-v0.10.28/bin/node
bamboo_capability_system_builder_ant_Ant=/home/bamboo/apache-ant-1.9.4
bamboo_capability_system_builder_mvn3_Maven_3=/home/bamboo/apache-maven-3.3.9
bamboo_tmp_directory=/home/bamboo/bamboo-agent-home/temp
bamboo_working_directory=/home/bamboo/bamboo-agent-home/xml-data/build-dir/CATS-CORE968-JOB1
bamboo_planKey=CATS-CORE968
bamboo_planRepository_1_repositoryUrl=ssh://git@opensource.ncsa.illinois.edu:7999/cats/clowder.git
bamboo_planRepository_username=
bamboo_capability_system_jdk_JDK_1_8=/home/bamboo/jdk1.8.0_66
bamboo_capability_system_jdk_JDK_1_6=/home/bamboo/jdk1.6.0_41
bamboo_capability_system_builder_command_mkcrx=/home/bamboo/mkcrx/mkcrx.sh
bamboo_capability_system_jdk_JDK_1_7=/home/bamboo/jdk1.7.0_60
bamboo_planRepository_1_branchName=hotfix/CATS-802-fix-swagger.yml
19-Feb-2019 16:44:54 Sending build context to Docker daemon  75.43MB
19-Feb-2019 16:44:54
19-Feb-2019 16:44:54 Step 1/20 : FROM java:jdk-alpine as clowder-build
19-Feb-2019 16:44:54 ---> 3fd9dd82815c
19-Feb-2019 16:44:54 Step 2/20 : WORKDIR /src
19-Feb-2019 16:44:54 ---> Using cache
19-Feb-2019 16:44:54 ---> f2277818e22d
19-Feb-2019 16:44:54 Step 3/20 : COPY sbt* /src/
19-Feb-2019 16:44:54 ---> Using cache
19-Feb-2019 16:44:54 ---> e8d104838693
19-Feb-2019 16:44:54 Step 4/20 : COPY project /src/project
19-Feb-2019 16:44:54 ---> Using cache
19-Feb-2019 16:44:54 ---> 862d8d50432d
19-Feb-2019 16:44:54 Step 5/20 : RUN ./sbt update
19-Feb-2019 16:44:54 ---> Using cache
19-Feb-2019 16:44:54 ---> bd8d8de36675
19-Feb-2019 16:44:54 Step 6/20 : COPY lib /src/lib/
19-Feb-2019 16:44:54 ---> Using cache
19-Feb-2019 16:44:54 ---> fc17e543a904
19-Feb-2019 16:44:54 Step 7/20 : COPY conf /src/conf/
19-Feb-2019 16:44:54 ---> Using cache
19-Feb-2019 16:44:54 ---> 4d3edd213e96
19-Feb-2019 16:44:54 Step 8/20 : COPY public /src/public/
19-Feb-2019 16:44:54 ---> Using cache
19-Feb-2019 16:44:54 ---> 4abb98bca0f3
19-Feb-2019 16:44:54 Step 9/20 : COPY app /src/app/
19-Feb-2019 16:44:54 ---> Using cache
19-Feb-2019 16:44:54 ---> 5c819f07f235
19-Feb-2019 16:44:54 Step 10/20 : RUN ./sbt dist     && unzip -q target/universal/clowder-*.zip     && mv clowder-* clowder     && mkdir -p clowder/custom clowder/logs
19-Feb-2019 16:44:54 ---> Using cache
19-Feb-2019 16:44:54 ---> 5ddbb28461c6
19-Feb-2019 16:44:54 Step 11/20 : FROM java:jre-alpine
19-Feb-2019 16:44:54 ---> fdc893b19a14
19-Feb-2019 16:44:54 Step 12/20 : RUN apk add --no-cache bash curl
19-Feb-2019 16:44:54 ---> Using cache
19-Feb-2019 16:44:54 ---> fd3df4da2a4a
19-Feb-2019 16:44:54 Step 13/20 : EXPOSE 9000
19-Feb-2019 16:44:54 ---> Using cache
19-Feb-2019 16:44:54 ---> 38079faba4ae
19-Feb-2019 16:44:54 Step 14/20 : WORKDIR /home/clowder
19-Feb-2019 16:44:54 ---> Using cache
19-Feb-2019 16:44:54 ---> 8de7440b9e10
19-Feb-2019 16:44:54 Step 15/20 : VOLUME /home/clowder/custom /home/clowder/data
19-Feb-2019 16:44:54 ---> Using cache
19-Feb-2019 16:44:54 ---> 05ad54d4b8f8
19-Feb-2019 16:44:54 Step 16/20 : COPY --from=clowder-build /src/clowder /home/clowder/
19-Feb-2019 16:44:54 ---> Using cache
19-Feb-2019 16:44:54 ---> aeca761c6c67
19-Feb-2019 16:44:54 Step 17/20 : COPY docker/clowder.sh docker/healthcheck.sh /home/clowder/
19-Feb-2019 16:44:54 ---> Using cache
19-Feb-2019 16:44:54 ---> 6fda57a8d646
19-Feb-2019 16:44:54 Step 18/20 : COPY docker/custom.conf docker/play.plugins /home/clowder/custom/
19-Feb-2019 16:44:54 ---> Using cache
19-Feb-2019 16:44:54 ---> c0b85289959f
19-Feb-2019 16:44:54 Step 19/20 : CMD /home/clowder/clowder.sh
19-Feb-2019 16:44:54 ---> Using cache
19-Feb-2019 16:44:54 ---> aea0090416b5
19-Feb-2019 16:44:54 Step 20/20 : HEALTHCHECK CMD /home/clowder/healthcheck.sh
19-Feb-2019 16:44:54 ---> Using cache
19-Feb-2019 16:44:54 ---> 6fbbbf6cd53e
19-Feb-2019 16:44:54 Successfully built 6fbbbf6cd53e
19-Feb-2019 16:44:54 Successfully tagged clowder/clowder:latest
19-Feb-2019 16:44:54 Sending build context to Docker daemon  22.02kB
19-Feb-2019 16:44:54
19-Feb-2019 16:44:54 Step 1/5 : FROM ubuntu
19-Feb-2019 16:44:54 ---> 47b19964fb50
19-Feb-2019 16:44:54 Step 2/5 : RUN apt-get -y update     && apt-get -y install curl unzip docker.io python python-dev python-pip     && pip install flask-restful     && pip install arrow     && apt-get clean all     && rm -rf /var/lib/apt/lists/* /tmp/* /var/tmp/*     ;
19-Feb-2019 16:44:54 ---> Using cache
19-Feb-2019 16:44:54 ---> d4684cf1e250
19-Feb-2019 16:44:54 Step 3/5 : COPY FILES.toolserver /
19-Feb-2019 16:44:54 ---> Using cache
19-Feb-2019 16:44:54 ---> 5674af441b42
19-Feb-2019 16:44:54 Step 4/5 : ENV TOOLSERVER_PORT 8082
19-Feb-2019 16:44:54 ---> Using cache
19-Feb-2019 16:44:54 ---> 066f430f1bc9
19-Feb-2019 16:44:54 Step 5/5 : CMD /usr/local/bin/usage
19-Feb-2019 16:44:54 ---> Using cache
19-Feb-2019 16:44:54 ---> 1602ed5d4339
19-Feb-2019 16:44:54 Successfully built 1602ed5d4339
19-Feb-2019 16:44:54 Successfully tagged clowder/toolserver:latest
19-Feb-2019 16:44:54 Sending build context to Docker daemon  11.26kB
19-Feb-2019 16:44:54
19-Feb-2019 16:44:54 Step 1/6 : FROM ubuntu:16.04
19-Feb-2019 16:44:54 ---> 7e87e2b3bf7a
19-Feb-2019 16:44:54 Step 2/6 : MAINTAINER Bing Zhang <bing@illinois.edu>
19-Feb-2019 16:44:54 ---> Using cache
19-Feb-2019 16:44:54 ---> 5722c2939370
19-Feb-2019 16:44:54 Step 3/6 : ENV EMAIL_ADDRESS=""    FIRST_NAME=""    LAST_NAME=""     PASSWORD=""    MONGO_URI=""    CLOWDER_PORT_9000_TCP_ADDR=""    CLOWDER_PORT_9000_TCP_PORT=""    RABBITMQ_PORT_15672_TCP_ADDR=""    RABBITMQ_PORT_15672_PORT=""    MONGO_PORT_27017_TCP_ADDR=""    MONGO_PORT_27017_TCP_PORT=""
19-Feb-2019 16:44:54 ---> Using cache
19-Feb-2019 16:44:54 ---> 4a763ee576c0
19-Feb-2019 16:44:54 Step 4/6 : RUN mkdir -p /data/db &&     apt-get update &&     apt-get install -y netcat curl lsb-release &&     apt-key adv --keyserver hkp://keyserver.ubuntu.com:80 --recv EA312927 &&     echo "deb http://repo.mongodb.org/apt/ubuntu "$(lsb_release -sc)"/mongodb-org/3.2 multiverse" | tee /etc/apt/sources.list.d/mongodb-org-3.2.list &&     apt-get update && apt-get install -y     mongodb-org     net-tools iproute     python3 python3-pip &&     pip3 install passlib bcrypt
19-Feb-2019 16:44:54 ---> Using cache
19-Feb-2019 16:44:54 ---> 71e7bd463c9c
19-Feb-2019 16:44:54 Step 5/6 : COPY FILES.mongo-init /
19-Feb-2019 16:44:54 ---> Using cache
19-Feb-2019 16:44:54 ---> 08d8eda835e8
19-Feb-2019 16:44:54 Step 6/6 : ENTRYPOINT ["/usr/local/bin/entrypoint.sh"]
19-Feb-2019 16:44:54 ---> Using cache
19-Feb-2019 16:44:54 ---> f6ccb401edbd
19-Feb-2019 16:44:54 Successfully built f6ccb401edbd
19-Feb-2019 16:44:54 Successfully tagged clowder/mongo-init:latest
19-Feb-2019 16:44:54 Finished task 'docker push' with result: Success
19-Feb-2019 16:44:54 Running post build plugin 'Docker Container Cleanup'
19-Feb-2019 16:44:54 Running post build plugin 'NCover Results Collector'
19-Feb-2019 16:44:54 Running post build plugin 'Clover Results Collector'
19-Feb-2019 16:44:54 Running post build plugin 'npm Cache Cleanup'
19-Feb-2019 16:44:54 Running post build plugin 'Artifact Copier'
19-Feb-2019 16:44:54 Publishing an artifact: dist
19-Feb-2019 16:45:04 Finished publishing of artifact Non required shared artifact: [dist], pattern: [clowder-*.zip] anchored at: [target/universal] in 10.11 s
19-Feb-2019 16:45:04 Publishing an artifact: scaladoc
19-Feb-2019 16:45:07 Finished publishing of artifact Non required shared artifact: [scaladoc], pattern: [**/*] anchored at: [target/scala-2.10/api] in 2.297 s
19-Feb-2019 16:45:07 Publishing an artifact: manual
19-Feb-2019 16:45:09 Finished publishing of artifact Non required shared artifact: [manual], pattern: [**/*] anchored at: [doc/src/sphinx/_build/html] in 1.929 s
19-Feb-2019 16:45:09 Finalising the build...
19-Feb-2019 16:45:09 Stopping timer.
19-Feb-2019 16:45:09 Build CATS-CORE968-JOB1-3 completed.
19-Feb-2019 16:45:09 Running on server: post build plugin 'NCover Results Collector'
19-Feb-2019 16:45:09 Running on server: post build plugin 'Build Hanging Detection Configuration'
19-Feb-2019 16:45:09 Running on server: post build plugin 'Clover Delta Calculator'
19-Feb-2019 16:45:09 Running on server: post build plugin 'Maven Dependencies Postprocessor'
19-Feb-2019 16:45:09 All post build plugins have finished
19-Feb-2019 16:45:09 Generating build results summary...
19-Feb-2019 16:45:09 Saving build results to disk...
19-Feb-2019 16:45:09 Logging substituted variables...
19-Feb-2019 16:45:09 Indexing build results...
19-Feb-2019 16:45:09 Finished building CATS-CORE968-JOB1-3.