Build #1

Build: #1 failed First build for this plan

Build result summary

Details

Completed
Duration
83 minutes
Labels
None
Revision
d7b51eff5059d73700174864f65f2d836094be7b d7b51eff5059d73700174864f65f2d836094be7b
Total tests
2288

No failed tests found, a possible compilation error occurred.

  • 0 New failures
  • 0 Existing failures
  • 0 Fixed

Responsible

No one has taken responsibility for this failure

Error summary for build, test, publish

The job generated some errors, drill down into the full build log for more details.

pred2 [1]: xs:boolean: true
bom: xs:unsignedShort: 65534
pred1 [1]: xs:boolean: false
pred2 [1]: xs:boolean: true
2013-09-26 22:16:59:467  edu.illinois.ncsa.daffodil.compiler.ProcessorFactory Error[Compilation (DataProcessor) reports 1 compile errors/warnings.]
2013-09-26 22:16:59:467  edu.illinois.ncsa.daffodil.compiler.ProcessorFactory Error[Schema Definition Error: Expression compiler reports: net.sf.saxon.trans.XPathException: XPath syntax error at char 10 in {fn:abs(-9)}:
    Prefix fn has not been declared
Schema context: element.abs. Location line 19 column 78 in file:/home/opensource/data/bamboo/xml-data/build-dir/DFDL-REV5-JOB1/daffodil-test/target/scala-2.9.2/test-classes/edu/illinois/ncsa/daffodil/section23/dfdl_functions/Functions-neg.dfdl.xsd.]
2013-09-26 22:17:00:151  edu.illinois.ncsa.daffodil.compiler.ProcessorFactory Error[Compilation (DataProcessor) reports 1 compile errors/warnings.]
2013-09-26 22:17:00:151  edu.illinois.ncsa.daffodil.compiler.ProcessorFactory Error[Schema Definition Error: '{ {{ [' is an unterminated expression.  Add missing closing brac, or escape opening brace with another opening brace.
Schema context: sequence. Location line 50 column 46 in file:/tmp/daffodil_tmp_468806359722827529.dfdl.xsd.]
2013-09-26 22:17:00:721  edu.illinois.ncsa.daffodil.compiler.ProcessorFactory Error[Compilation (DataProcessor) reports 1 compile errors/warnings.]
2013-09-26 22:17:00:721  edu.illinois.ncsa.daffodil.compiler.ProcessorFactory Error[Schema Definition Error: Expression compiler reports: net.sf.saxon.trans.XPathException: Value 12345678987654321 cannot be converted to integer subtype xs:short
Schema context: element.short02. Location line 115 column 765 in file:/tmp/daffodil_tmp_4660316369584076319.dfdl.xsd.]
2013-09-26 22:17:01:056  edu.illinois.ncsa.daffodil.compiler.ProcessorFactory Error[Compilation (DataProcessor) reports 1 compile errors/warnings.]
2013-09-26 22:17:01:056  edu.illinois.ncsa.daffodil.compiler.ProcessorFactory Error[Schema Definition Error: Expression compiler reports: javax.xml.xpath.XPathExpressionException: no such function: {http://www.ogf.org/dfdl/dfdl-1.0/}setBits with arity 6
Schema context: element.setBits1. Location line 53 column 421 in file:/tmp/daffodil_tmp_5807025195391359600.dfdl.xsd.]
2013-09-26 22:17:01:295  edu.illinois.ncsa.daffodil.compiler.ProcessorFactory Error[Compilation (DataProcessor) reports 1 compile errors/warnings.]
2013-09-26 22:17:01:295  edu.illinois.ncsa.daffodil.compiler.ProcessorFactory Error[Schema Definition Error: Cannot convert 2.5 to Int.
Schema context: element.e3. Location line 25 column 77 in file:/tmp/daffodil_tmp_1616298542003301356.dfdl.xsd.]
2013-09-26 22:17:01:352  edu.illinois.ncsa.daffodil.compiler.ProcessorFactory Error[Compilation (DataProcessor) reports 1 compile errors/warnings.]
2013-09-26 22:17:01:352  edu.illinois.ncsa.daffodil.compiler.ProcessorFactory Error[Schema Definition Error: Expression compiler reports: net.sf.saxon.trans.XPathException: Arithmetic operator is not defined for arguments of types (xs:decimal, xs:string)
Schema context: element.e1. Location line 38 column 98 in file:/tmp/daffodil_tmp_2221866330747430663.dfdl.xsd.]
r [1]: element(ex:r, untyped): /ex:e/ex:s[1]/ex:r[1]
r [2]: element(ex:r, untyped): /ex:e/ex:s[1]/ex:r[2]
r [1]: element(ex:r, untyped): /ex:e/ex:s[1]/ex:r[1]
r [1]: element(ex:r, untyped): /ex:e/ex:s[1]/ex:r[1]
r [2]: element(ex:r, untyped): /ex:e/ex:s[1]/ex:r[2]
r [1]: element(ex:r, untyped): /ex:e/ex:s[1]/ex:r[1]
r [2]: element(ex:r, untyped): /ex:e/ex:s[1]/ex:r[2]
r [3]: element(ex:r, untyped): /ex:e/ex:s[1]/ex:r[3]
r [1]: element(ex:r, untyped): /ex:e/ex:s[1]/ex:r[1]
r [2]: element(ex:r, untyped): /ex:e/ex:s[1]/ex:r[2]
r [3]: element(ex:r, untyped): /ex:e/ex:s[1]/ex:r[3]
r [4]: element(ex:r, untyped): /ex:e/ex:s[1]/ex:r[4]
r [5]: element(ex:r, untyped): /ex:e/ex:s[1]/ex:r[5]
r [1]: element(ex:r, untyped): /ex:e/ex:s[1]/ex:r[1]
r [1]: element(ex:r, untyped): /ex:e/ex:s[1]/ex:r[1]
r [2]: element(ex:r, untyped): /ex:e/ex:s[1]/ex:r[2]
r [1]: element(ex:r, untyped): /ex:e/ex:s[1]/ex:r[1]
r [2]: element(ex:r, untyped): /ex:e/ex:s[1]/ex:r[2]
r [3]: element(ex:r, untyped): /ex:e/ex:s[1]/ex:r[3]
r [1]: element(ex:r, untyped): /ex:e/ex:s[1]/ex:r[1]
r [2]: element(ex:r, untyped): /ex:e/ex:s[1]/ex:r[2]
r [3]: element(ex:r, untyped): /ex:e/ex:s[1]/ex:r[3]
r [4]: element(ex:r, untyped): /ex:e/ex:s[1]/ex:r[4]
r [5]: element(ex:r, untyped): /ex:e/ex:s[1]/ex:r[5]
2013-09-26 22:17:02:927  edu.illinois.ncsa.daffodil.compiler.ProcessorFactory Error[Compilation (DataProcessor) reports 1 compile errors/warnings.]
2013-09-26 22:17:02:927  edu.illinois.ncsa.daffodil.compiler.ProcessorFactory Error[Schema Definition Error: Expression compiler reports: net.sf.saxon.trans.XPathException: XPath syntax error at char 18 in {theUnknownPrefix:x}:
    Prefix theUnknownPrefix has not been declared
Schema context: element.theElementName. Location line 14 column 386 in file:/tmp/daffodil_tmp_8256169387984306667.dfdl.xsd.]
2013-09-26 22:17:03:443  edu.illinois.ncsa.daffodil.compiler.ProcessorFactory Error[Compilation (DataProcessor) reports 1 compile errors/warnings.]
2013-09-26 22:17:03:443  edu.illinois.ncsa.daffodil.compiler.ProcessorFactory Error[Schema Definition Error: Expression compiler reports: net.sf.saxon.trans.XPathException: Value -50 cannot be converted to integer subtype xs:unsignedShort
Schema context: element.ushort01. Location line 108 column 395 in file:/tmp/daffodil_tmp_1796536637293701617.dfdl.xsd.]
2013-09-26 22:17:03:493  edu.illinois.ncsa.daffodil.compiler.ProcessorFactory Error[Compilation (DataProcessor) reports 1 compile errors/warnings.]
2013-09-26 22:17:03:493  edu.illinois.ncsa.daffodil.compiler.ProcessorFactory Error[Schema Definition Error: Expression compiler reports: net.sf.saxon.trans.XPathException: Value 12345678987654321 cannot be converted to integer subtype xs:unsignedShort
Schema context: element.ushort02. Location line 108 column 799 in file:/tmp/daffodil_tmp_7757770367857957767.dfdl.xsd.]
2013-09-26 22:17:03:711  edu.illinois.ncsa.daffodil.compiler.ProcessorFactory Error[Compilation (DataProcessor) reports 1 compile errors/warnings.]
2013-09-26 22:17:03:711  edu.illinois.ncsa.daffodil.compiler.ProcessorFactory Error[Schema Definition Error: Expression compiler reports: javax.xml.xpath.XPathExpressionException: no such function: {http://www.ogf.org/dfdl/dfdl-1.0/}notAFunction with arity 3
Schema context: element.err. Location line 86 column 101 in file:/tmp/daffodil_tmp_8262723245767342291.dfdl.xsd.]
2013-09-26 22:17:03:976  edu.illinois.ncsa.daffodil.compiler.ProcessorFactory Error[Compilation (DataProcessor) reports 1 compile errors/warnings.]
2013-09-26 22:17:03:976  edu.illinois.ncsa.daffodil.compiler.ProcessorFactory Error[Schema Definition Error: Expression compiler reports: net.sf.saxon.trans.XPathException: Value -50 cannot be converted to integer subtype xs:unsignedLong
Schema context: element.ulong01. Location line 101 column 392 in file:/tmp/daffodil_tmp_2685512274942624083.dfdl.xsd.]
2013-09-26 22:17:04:325  edu.illinois.ncsa.daffodil.compiler.Compiler Error[Compilation (ProcessorFactory) produced 2 errors/warnings.]
2013-09-26 22:17:04:326  edu.illinois.ncsa.daffodil.compiler.Compiler Error[Schema Definition Error: Error loading schema due to org.xml.sax.SAXParseException; lineNumber: 22; columnNumber: 196; cvc-pattern-valid: Value '{ ../../ex:ncols ' is not facet-valid with respect to pattern '(\{[^\{].*\})|(\{\})' for type 'DFDLExpression'.
Schema context: file:/tmp/daffodil_tmp_8067714740555893140.dfdl.xsd. Location in /tmp/daffodil_tmp_8067714740555893140.dfdl.xsd.]
2013-09-26 22:17:04:326  edu.illinois.ncsa.daffodil.compiler.Compiler Error[Schema Definition Error: Error loading schema due to org.xml.sax.SAXParseException; lineNumber: 22; columnNumber: 196; cvc-attribute.3: The value '{ ../../ex:ncols ' of attribute 'dfdl:occursCount' on element 'xs:element' is not valid with respect to its type, 'DFDLExpression'.
Schema context: file:/tmp/daffodil_tmp_8067714740555893140.dfdl.xsd. Location in /tmp/daffodil_tmp_8067714740555893140.dfdl.xsd.]
predicate: empty sequence
2013-09-26 22:17:04:497  edu.illinois.ncsa.daffodil.compiler.Compiler Error[Compilation (ProcessorFactory) produced 2 errors/warnings.]
2013-09-26 22:17:04:497  edu.illinois.ncsa.daffodil.compiler.Compiler Error[Schema Definition Error: Error loading schema due to org.xml.sax.SAXParseException; lineNumber: 14; columnNumber: 79; cvc-enumeration-valid: Value 'hieroglyphs' is not facet-valid with respect to enumeration '[binary, text]'. It must be a value from the enumeration.
Schema context: file:/home/opensource/data/bamboo/xml-data/build-dir/DFDL-REV5-JOB1/daffodil-test/target/scala-2.9.2/test-classes/edu/illinois/ncsa/daffodil/section23/dfdl_expressions/expressions_broken.dfdl.xsd. Location in /home/opensource/data/bamboo/xml-data/build-dir/DFDL-REV5-JOB1/daffodil-test/target/scala-2.9.2/test-classes/edu/illinois/ncsa/daffodil/section23/dfdl_expressions/expressions_broken.dfdl.xsd.]
2013-09-26 22:17:04:497  edu.illinois.ncsa.daffodil.compiler.Compiler Error[Schema Definition Error: Error loading schema due to org.xml.sax.SAXParseException; lineNumber: 14; columnNumber: 79; cvc-attribute.3: The value 'hieroglyphs' of attribute 'representation' on element 'dfdl:element' is not valid with respect to its type, 'RepresentationEnum'.
Schema context: file:/home/opensource/data/bamboo/xml-data/build-dir/DFDL-REV5-JOB1/daffodil-test/target/scala-2.9.2/test-classes/edu/illinois/ncsa/daffodil/section23/dfdl_expressions/expressions_broken.dfdl.xsd. Location in /home/opensource/data/bamboo/xml-data/build-dir/DFDL-REV5-JOB1/daffodil-test/target/scala-2.9.2/test-classes/edu/illinois/ncsa/daffodil/section23/dfdl_expressions/expressions_broken.dfdl.xsd.]
2013-09-26 22:17:04:526  edu.illinois.ncsa.daffodil.compiler.Compiler Error[Compilation (ProcessorFactory) produced 2 errors/warnings.]
2013-09-26 22:17:04:526  edu.illinois.ncsa.daffodil.compiler.Compiler Error[Schema Definition Error: Error loading schema due to org.xml.sax.SAXParseException; lineNumber: 14; columnNumber: 72; cvc-enumeration-valid: Value 'TExT' is not facet-valid with respect to enumeration '[binary, text]'. It must be a value from the enumeration.
Schema context: file:/home/opensource/data/bamboo/xml-data/build-dir/DFDL-REV5-JOB1/daffodil-test/target/scala-2.9.2/test-classes/edu/illinois/ncsa/daffodil/section23/dfdl_expressions/expressions_broken_2.dfdl.xsd. Location in /home/opensource/data/bamboo/xml-data/build-dir/DFDL-REV5-JOB1/daffodil-test/target/scala-2.9.2/test-classes/edu/illinois/ncsa/daffodil/section23/dfdl_expressions/expressions_broken_2.dfdl.xsd.]
2013-09-26 22:17:04:527  edu.illinois.ncsa.daffodil.compiler.Compiler Error[Schema Definition Error: Error loading schema due to org.xml.sax.SAXParseException; lineNumber: 14; columnNumber: 72; cvc-attribute.3: The value 'TExT' of attribute 'representation' on element 'dfdl:element' is not valid with respect to its type, 'RepresentationEnum'.
Schema context: file:/home/opensource/data/bamboo/xml-data/build-dir/DFDL-REV5-JOB1/daffodil-test/target/scala-2.9.2/test-classes/edu/illinois/ncsa/daffodil/section23/dfdl_expressions/expressions_broken_2.dfdl.xsd. Location in /home/opensource/data/bamboo/xml-data/build-dir/DFDL-REV5-JOB1/daffodil-test/target/scala-2.9.2/test-classes/edu/illinois/ncsa/daffodil/section23/dfdl_expressions/expressions_broken_2.dfdl.xsd.]
2013-09-26 22:17:04:564  edu.illinois.ncsa.daffodil.compiler.Compiler Error[Compilation (ProcessorFactory) produced 2 errors/warnings.]
2013-09-26 22:17:04:564  edu.illinois.ncsa.daffodil.compiler.Compiler Error[Schema Definition Error: Error loading schema due to org.xml.sax.SAXParseException; lineNumber: 9; columnNumber: 86; cvc-enumeration-valid: Value '0' is not facet-valid with respect to enumeration '[yes, no]'. It must be a value from the enumeration.
Schema context: file:/home/opensource/data/bamboo/xml-data/build-dir/DFDL-REV5-JOB1/daffodil-test/target/scala-2.9.2/test-classes/edu/illinois/ncsa/daffodil/section23/dfdl_expressions/expressions_broken_3.dfdl.xsd. Location in /home/opensource/data/bamboo/xml-data/build-dir/DFDL-REV5-JOB1/daffodil-test/target/scala-2.9.2/test-classes/edu/illinois/ncsa/daffodil/section23/dfdl_expressions/expressions_broken_3.dfdl.xsd.]
2013-09-26 22:17:04:564  edu.illinois.ncsa.daffodil.compiler.Compiler Error[Schema Definition Error: Error loading schema due to org.xml.sax.SAXParseException; lineNumber: 9; columnNumber: 86; cvc-attribute.3: The value '0' of attribute 'documentFinalTerminatorCanBeMissing' on element 'dfdl:format' is not valid with respect to its type, 'YesNoEnum'.
Schema context: file:/home/opensource/data/bamboo/xml-data/build-dir/DFDL-REV5-JOB1/daffodil-test/target/scala-2.9.2/test-classes/edu/illinois/ncsa/daffodil/section23/dfdl_expressions/expressions_broken_3.dfdl.xsd. Location in /home/opensource/data/bamboo/xml-data/build-dir/DFDL-REV5-JOB1/daffodil-test/target/scala-2.9.2/test-classes/edu/illinois/ncsa/daffodil/section23/dfdl_expressions/expressions_broken_3.dfdl.xsd.]
predicate: xs:boolean: true
2013-09-26 22:17:05:736  edu.illinois.ncsa.daffodil.dsom.Include Info[Included schema from jar:file:/home/opensource/data/bamboo/xml-data/build-dir/DFDL-REV5-JOB1/daffodil-lib/target/scala-2.9.2/daffodil-lib_2.9.2-0.0.0-SNAPSHOT.jar!/xsd/built-in-formats.xsd into namespace No_Namespace.]
2013-09-26 22:17:05:773  edu.illinois.ncsa.daffodil.dsom.Include Info[Included schema from jar:file:/home/opensource/data/bamboo/xml-data/build-dir/DFDL-REV5-JOB1/daffodil-lib/target/scala-2.9.2/daffodil-lib_2.9.2-0.0.0-SNAPSHOT.jar!/xsd/built-in-formats.xsd into namespace No_Namespace.]
2013-09-26 22:17:05:810  edu.illinois.ncsa.daffodil.compiler.Compiler Error[Compilation (ProcessorFactory) produced 1 errors/warnings.]
2013-09-26 22:17:05:810  edu.illinois.ncsa.daffodil.compiler.Compiler Error[Schema Definition Error: Error loading schema due to org.xml.sax.SAXParseException; lineNumber: 5; columnNumber: 26; cvc-complex-type.4: Attribute 'name' must appear on element 'dfdl:defineFormat'.
Schema context: file:/home/opensource/data/bamboo/xml-data/build-dir/DFDL-REV5-JOB1/daffodil-test/target/scala-2.9.2/test-classes/edu/illinois/ncsa/daffodil/section07/defineFormat/noNameFormat.dfdl.xsd. Location in /home/opensource/data/bamboo/xml-data/build-dir/DFDL-REV5-JOB1/daffodil-test/target/scala-2.9.2/test-classes/edu/illinois/ncsa/daffodil/section07/defineFormat/noNameFormat.dfdl.xsd.]
2013-09-26 22:17:05:830  edu.illinois.ncsa.daffodil.compiler.Compiler Error[Compilation (ProcessorFactory) produced 1 errors/warnings.]
2013-09-26 22:17:05:830  edu.illinois.ncsa.daffodil.compiler.Compiler Error[Schema Definition Error: Format ref attributes form a cycle:
((http://example.com,def),Location line 10 column 45 in file:/tmp/daffodil_tmp_4215699175044140338.dfdl.xsd)
(http://example.com,def) -> Location line 8 column 140 in file:/tmp/daffodil_tmp_4215699175044140338.dfdl.xsd
(http://example.com,def2) -> Location line 10 column 45 in file:/tmp/daffodil_tmp_4215699175044140338.dfdl.xsd
Schema context: SchemaDocument::DFDLFormat. Location line 10 column 45 in file:/tmp/daffodil_tmp_4215699175044140338.dfdl.xsd.]
2013-09-26 22:17:06:342  edu.illinois.ncsa.daffodil.compiler.ProcessorFactory Error[Compilation (DataProcessor) reports 1 compile errors/warnings.]
2013-09-26 22:17:06:343  edu.illinois.ncsa.daffodil.compiler.ProcessorFactory Error[Schema Definition Error: Element element.def does not meet the requirements of Pattern-Based lengths and Scanability.
The element and its children must be representation='text' and share the same encoding.
Schema context: element.def. Location line 50 column 394 in file:/tmp/daffodil_tmp_703995520222190158.dfdl.xsd.]
[oolagdebug] Evaluated SchemaSet@@requiredEvaluations to ().
[oolagdebug] Evaluating SchemaSet@@requiredEvaluations
[oolagdebug] Evaluated SchemaSet@@requiredEvaluations to ().
[oolagdebug] Evaluating SchemaSet@@requiredEvaluations
[oolagdebug] Evaluated SchemaSet@@requiredEvaluations to ().
[oolagdebug] Evaluating SchemaSet@@requiredEvaluations
[oolagdebug] Evaluated SchemaSet@@requiredEvaluations to ().
[oolagdebug] Evaluating SchemaSet@@requiredEvaluations
[oolagdebug] Evaluated SchemaSet@@requiredEvaluations to ().
[oolagdebug] Evaluating SchemaSet@@requiredEvaluations
[oolagdebug] Evaluated SchemaSet@@requiredEvaluations to ().
[oolagdebug] Evaluating SchemaSet@@requiredEvaluations
[oolagdebug] Evaluated SchemaSet@@requiredEvaluations to ().
[oolagdebug] Evaluating SchemaSet@@requiredEvaluations
[oolagdebug] Evaluated SchemaSet@@requiredEvaluations to ().
[oolagdebug] Evaluating SchemaSet@@requiredEvaluations
[oolagdebug] Evaluated SchemaSet@@requiredEvaluations to ().
[oolagdebug] Evaluating SchemaSet@@requiredEvaluations
[oolagdebug] Evaluated SchemaSet@@requiredEvaluations to ().
[oolagdebug] Evaluating SchemaSet@@requiredEvaluations
[oolagdebug] Evaluated SchemaSet@@requiredEvaluations to ().
[oolagdebug] Evaluating SchemaSet@@requiredEvaluations
[oolagdebug] Evaluated SchemaSet@@requiredEvaluations to ().
[oolagdebug] Evaluating SchemaSet@@requiredEvaluations
[oolagdebug] Evaluated SchemaSet@@requiredEvaluations to ().
[oolagdebug] Evaluating SchemaSet@@requiredEvaluations
[oolagdebug] Evaluated SchemaSet@@requiredEvaluations to ().
[oolagdebug] Evaluating SchemaSet@@requiredEvaluations
[oolagdebug] Evaluated SchemaSet@@requiredEvaluations to ().
[oolagdebug] Evaluating SchemaSet@@requiredEvaluations
[oolagdebug] Evaluated SchemaSet@@requiredEvaluations to ().
[oolagdebug] Evaluating SchemaSet@@requiredEvaluations
[oolagdebug] Evaluated SchemaSet@@requiredEvaluations to ().
[oolagdebug] Evaluating SchemaSet@@requiredEvaluations
[oolagdebug] Evaluated SchemaSet@@requiredEvaluations to ().
[oolagdebug] Evaluating SchemaSet@@requiredEvaluations
[oolagdebug] Evaluated SchemaSet@@requiredEvaluations to ().
[oolagdebug] Evaluating SchemaSet@@requiredEvaluations
[oolagdebug] Evaluated SchemaSet@@requiredEvaluations to ().
[oolagdebug] Evaluating SchemaSet@@requiredEvaluations
[oolagdebug] Evaluated SchemaSet@@requiredEvaluations to ().
[oolagdebug] Evaluating SchemaSet@@requiredEvaluations
[oolagdebug] Evaluated SchemaSet@@requiredEvaluations to ().
[oolagdebug] Evaluating SchemaSet@@requiredEvaluations
[oolagdebug] Evaluated SchemaSet@@requiredEvaluations to ().
[oolagdebug] Evaluating SchemaSet@@requiredEvaluations
[oolagdebug] Evaluated SchemaSet@@requiredEvaluations to ().
[oolagdebug] Evaluating SchemaSet@@requiredEvaluations
[oolagdebug] Evaluated SchemaSet@@requiredEvaluations to ().
[oolagdebug] Evaluating SchemaSet@@requiredEvaluations
[oolagdebug] Evaluated SchemaSet@@requiredEvaluations to ().
[oolagdebug] Evaluating SchemaSet@@requiredEvaluations
[oolagdebug] Evaluated SchemaSet@@requiredEvaluations to ().
[oolagdebug] Evaluating SchemaSet@@requiredEvaluations
[oolagdebug] Evaluated SchemaSet@@requiredEvaluations to ().
[oolagdebug] Evaluating SchemaSet@@requiredEvaluations
[oolagdebug] Evaluated SchemaSet@@requiredEvaluations to ().
[oolagdebug] Evaluating SchemaSet@@requiredEvaluations
[oolagdebug] Evaluated SchemaSet@@requiredEvaluations to ().
[error] Left over data. 3 bytes available. Location: byte 2
UTF-8 text starting at byte 0 is: (12
)
Data (hex) starting at byte 0 is: (0x31320A)
[error] Left over data. 6 bytes available. Location: byte 5
UTF-8 text starting at byte 0 is: (0,1,2
)
Data (hex) starting at byte 0 is: (0x302C312C320A)
[error] One of --schema or --parser must be defined
[error] --root must be defined if --namespace is defined
[error] Left over data. 6 bytes available. Location: byte 1
UTF-8 text starting at byte 0 is: (0,1,2
)
Data (hex) starting at byte 0 is: (0x302C312C320A)
[error] Left over data. 6 bytes available. Location: byte 0
UTF-8 text starting at byte 0 is: (0,1,2
)
Data (hex) starting at byte 0 is: (0x302C312C320A)
[error] Compilation (ProcessorFactory) produced 2 errors/warnings.
[error] Schema Definition Error: Error loading schema due to org.xml.sax.SAXParseException; lineNumber: 13; columnNumber: 79; cvc-datatype-valid.1.2.3: 'fixed' is not a valid value of union type 'allNNI'.
Schema context: file:/home/opensource/data/bamboo/xml-data/build-dir/DFDL-REV5-JOB1/daffodil-cli/src/test/resources/edu/illinois/ncsa/daffodil/CLI/ABC_IBM_invalid.xsd. Location in daffodil-cli/src/test/resources/edu/illinois/ncsa/daffodil/CLI/ABC_IBM_invalid.xsd.
[error] Schema Definition Error: Error loading schema due to org.xml.sax.SAXParseException; lineNumber: 13; columnNumber: 79; cvc-attribute.3: The value 'fixed' of attribute 'maxOccurs' on element 'xsd:element' is not valid with respect to its type, 'allNNI'.
Schema context: file:/home/opensource/data/bamboo/xml-data/build-dir/DFDL-REV5-JOB1/daffodil-cli/src/test/resources/edu/illinois/ncsa/daffodil/CLI/ABC_IBM_invalid.xsd. Location in daffodil-cli/src/test/resources/edu/illinois/ncsa/daffodil/CLI/ABC_IBM_invalid.xsd.
[error] Compilation (ProcessorFactory) produced 1 errors/warnings.
[error] Schema Definition Error: No root element found for unknown in any available namespace
Schema context: SchemaSet. Location in daffodil-test/src/test/resources/edu/illinois/ncsa/daffodil/section06/entities/charClassEntities.dfdl.xsd.
[warning] Using --debug on a non-interactive console may result in display issues
[warning] Using --debug on a non-interactive console may result in display issues
[warning] Using --debug on a non-interactive console may result in display issues
[warning] Using --debug on a non-interactive console may result in display issues
[warning] Using --debug on a non-interactive console may result in display issues
[warning] Using --debug on a non-interactive console may result in display issues
[warning] Using --debug on a non-interactive console may result in display issues
[warning] Using --debug on a non-interactive console may result in display issues
[warning] Using --debug on a non-interactive console may result in display issues
[warning] Using --debug on a non-interactive console may result in display issues
[warning] Using --debug on a non-interactive console may result in display issues
[warning] Using --debug on a non-interactive console may result in display issues
[warning] Using --debug on a non-interactive console may result in display issues
[warning] Using --debug on a non-interactive console may result in display issues
[warning] Using --debug on a non-interactive console may result in display issues