Build: #311 failed Manual run by Luigi Marini

Build result summary

Details

Completed
Duration
29 seconds
Labels
None
Agent
buildserver-3.os.ncsa.edu
Revisions
theme
7e8af9c8e49c8427b1494cb3cceefad738fd06be 7e8af9c8e49c8427b1494cb3cceefad738fd06be
GeoDashboard
91a8cd6b2b100dd1e7bbb0d9656726e238b4e7bd 91a8cd6b2b100dd1e7bbb0d9656726e238b4e7bd
Failing since
#308 (Changes by 3 people)
Fixed in
#313 (Manual run by Luigi Marini)
No failed test found. A possible compilation error occurred.

Responsible

Error summary for Default Job

The job generated some errors, drill down into the full build log for more details.

npm WARN engine cryptiles@2.0.5: wanted: {"node":">=0.10.40"} (current: {"node":"v0.10.28","npm":"1.4.9"})
npm WARN engine hoek@2.16.3: wanted: {"node":">=0.10.40"} (current: {"node":"v0.10.28","npm":"1.4.9"})
npm WARN engine boom@2.10.1: wanted: {"node":">=0.10.40"} (current: {"node":"v0.10.28","npm":"1.4.9"})
npm http GET https://registry.npmjs.org/jsonpointer
npm http GET https://registry.npmjs.org/xtend
npm http GET https://registry.npmjs.org/generate-function
npm http GET https://registry.npmjs.org/generate-object-property
npm http GET https://registry.npmjs.org/is-my-ip-valid
npm http 304 https://registry.npmjs.org/is-my-ip-valid
npm http 304 https://registry.npmjs.org/generate-object-property
npm http 304 https://registry.npmjs.org/jsonpointer
npm http 304 https://registry.npmjs.org/generate-function
npm http 304 https://registry.npmjs.org/xtend
npm http GET https://registry.npmjs.org/getpass
npm http GET https://registry.npmjs.org/dashdash
npm http GET https://registry.npmjs.org/safer-buffer
npm http GET https://registry.npmjs.org/jsbn
npm http GET https://registry.npmjs.org/tweetnacl
npm http GET https://registry.npmjs.org/ecc-jsbn
npm http GET https://registry.npmjs.org/bcrypt-pbkdf
npm http GET https://registry.npmjs.org/asn1
npm http 304 https://registry.npmjs.org/safer-buffer
npm http 304 https://registry.npmjs.org/jsbn
npm http 304 https://registry.npmjs.org/getpass
npm http 304 https://registry.npmjs.org/ecc-jsbn
npm http 304 https://registry.npmjs.org/bcrypt-pbkdf
npm http 304 https://registry.npmjs.org/dashdash
npm http 304 https://registry.npmjs.org/asn1
npm http 304 https://registry.npmjs.org/tweetnacl
npm http GET https://registry.npmjs.org/is-property
npm http GET https://registry.npmjs.org/is-property
npm http 304 https://registry.npmjs.org/is-property
npm http 304 https://registry.npmjs.org/is-property
npm http GET https://registry.npmjs.org/amdefine
npm http 304 https://registry.npmjs.org/amdefine
npm WARN engine cryptiles@2.0.5: wanted: {"node":">=0.10.40"} (current: {"node":"v0.10.28","npm":"1.4.9"})
npm WARN engine hoek@2.16.3: wanted: {"node":">=0.10.40"} (current: {"node":"v0.10.28","npm":"1.4.9"})
npm WARN engine boom@2.10.1: wanted: {"node":">=0.10.40"} (current: {"node":"v0.10.28","npm":"1.4.9"})
npm http GET https://registry.npmjs.org/mocha-phantomjs
npm http 304 https://registry.npmjs.org/mocha-phantomjs
npm http GET https://registry.npmjs.org/mocha
npm http 304 https://registry.npmjs.org/mocha
npm http GET https://registry.npmjs.org/highlight.js
npm http GET https://registry.npmjs.org/marked
npm http 304 https://registry.npmjs.org/marked
npm http 304 https://registry.npmjs.org/highlight.js
npm WARN engine fs-extra@7.0.1: wanted: {"node":">=6 <7 || >=8"} (current: {"node":"v0.10.28","npm":"1.4.9"})
npm http GET https://registry.npmjs.org/keypress
npm http 304 https://registry.npmjs.org/keypress
npm http GET https://registry.npmjs.org/rimraf
npm http 304 https://registry.npmjs.org/rimraf
npm WARN engine hawk@3.1.3: wanted: {"node":">=0.10.32"} (current: {"node":"v0.10.28","npm":"1.4.9"})
npm http GET https://registry.npmjs.org/universalify
npm http 304 https://registry.npmjs.org/universalify
npm http GET https://registry.npmjs.org/async
npm WARN engine universalify@0.1.2: wanted: {"node":">= 4.0.0"} (current: {"node":"v0.10.28","npm":"1.4.9"})
npm http 304 https://registry.npmjs.org/async
npm http GET https://registry.npmjs.org/chalk
npm http GET https://registry.npmjs.org/minimatch
npm http GET https://registry.npmjs.org/lodash
npm http 304 https://registry.npmjs.org/chalk
npm http 304 https://registry.npmjs.org/minimatch
npm http 304 https://registry.npmjs.org/lodash
npm http GET https://registry.npmjs.org/diff
npm http GET https://registry.npmjs.org/growl
npm http GET https://registry.npmjs.org/glob
npm http GET https://registry.npmjs.org/jade
npm http 304 https://registry.npmjs.org/diff
npm http 304 https://registry.npmjs.org/jade
npm http 304 https://registry.npmjs.org/glob
npm http 304 https://registry.npmjs.org/growl
npm WARN deprecated jade@0.26.3: Jade has been renamed to pug, please install the latest version of pug instead of jade
npm http GET https://registry.npmjs.org/supports-color
npm http GET https://registry.npmjs.org/strip-ansi
npm http GET https://registry.npmjs.org/ansi-styles
npm http GET https://registry.npmjs.org/escape-string-regexp
npm http GET https://registry.npmjs.org/has-ansi
npm http 304 https://registry.npmjs.org/has-ansi
npm http 304 https://registry.npmjs.org/escape-string-regexp
npm http 304 https://registry.npmjs.org/supports-color
npm http 304 https://registry.npmjs.org/strip-ansi
npm http 304 https://registry.npmjs.org/ansi-styles
npm http GET https://registry.npmjs.org/ansi-regex
npm http 304 https://registry.npmjs.org/ansi-regex
npm http GET https://registry.npmjs.org/inherits
npm http 304 https://registry.npmjs.org/inherits
npm http GET https://registry.npmjs.org/ms
npm http 304 https://registry.npmjs.org/ms
npm http GET https://registry.npmjs.org/graceful-fs
npm http 304 https://registry.npmjs.org/graceful-fs
npm WARN deprecated graceful-fs@2.0.3: please upgrade to graceful-fs 4 for compatibility with current and future versions of Node.js
npm WARN engine boom@2.10.1: wanted: {"node":">=0.10.40"} (current: {"node":"v0.10.28","npm":"1.4.9"})
npm WARN engine hoek@2.16.3: wanted: {"node":">=0.10.40"} (current: {"node":"v0.10.28","npm":"1.4.9"})
npm WARN engine cryptiles@2.0.5: wanted: {"node":">=0.10.40"} (current: {"node":"v0.10.28","npm":"1.4.9"})
npm http GET https://registry.npmjs.org/lru-cache
npm http GET https://registry.npmjs.org/sigmund
npm http 304 https://registry.npmjs.org/lru-cache
npm http 304 https://registry.npmjs.org/sigmund
npm http GET https://registry.npmjs.org/mkdirp
npm http 304 https://registry.npmjs.org/mkdirp
npm http GET https://registry.npmjs.org/tiny-lr
npm http 304 https://registry.npmjs.org/semver
npm http GET https://registry.npmjs.org/graceful-fs
npm http GET https://registry.npmjs.org/inherits
npm http 304 https://registry.npmjs.org/js-beautify
npm http 304 https://registry.npmjs.org/inherits
npm http 304 https://registry.npmjs.org/tiny-lr
npm http 304 https://registry.npmjs.org/rc
npm http 304 https://registry.npmjs.org/graceful-fs
npm http 304 https://registry.npmjs.org/gaze
npm WARN deprecated graceful-fs@1.2.3: please upgrade to graceful-fs 4 for compatibility with current and future versions of Node.js
npm WARN deprecated minimatch@0.3.0: Please update to minimatch 3.0.2 or higher to avoid a RegExp DoS issue
npm http GET https://registry.npmjs.org/argparse
npm http GET https://registry.npmjs.org/esprima
npm http GET https://registry.npmjs.org/deep-extend
npm http GET https://registry.npmjs.org/ini
npm http GET https://registry.npmjs.org/minimist
npm http GET https://registry.npmjs.org/strip-json-comments
npm http 304 https://registry.npmjs.org/esprima
npm http 304 https://registry.npmjs.org/minimist
npm http 304 https://registry.npmjs.org/ini
npm http 304 https://registry.npmjs.org/deep-extend
npm http 304 https://registry.npmjs.org/argparse
npm http 304 https://registry.npmjs.org/strip-json-comments
npm WARN engine deep-extend@0.6.0: wanted: {"node":">=4.0.0"} (current: {"node":"v0.10.28","npm":"1.4.9"})
npm http GET https://registry.npmjs.org/noptify
npm http GET https://registry.npmjs.org/qs
npm http GET https://registry.npmjs.org/faye-websocket
npm http GET https://registry.npmjs.org/debug
npm http 304 https://registry.npmjs.org/noptify
npm http 304 https://registry.npmjs.org/qs
npm http 304 https://registry.npmjs.org/faye-websocket
npm http 304 https://registry.npmjs.org/debug
npm http GET https://registry.npmjs.org/globule
npm http 304 https://registry.npmjs.org/globule
npm http GET https://registry.npmjs.org/underscore
npm http 304 https://registry.npmjs.org/underscore
npm http GET https://registry.npmjs.org/util-deprecate
npm http GET https://registry.npmjs.org/sprintf-js
npm http 304 https://registry.npmjs.org/util-deprecate
npm http 304 https://registry.npmjs.org/sprintf-js
npm http GET https://registry.npmjs.org/mkdirp
npm http GET https://registry.npmjs.org/editorconfig
npm http GET https://registry.npmjs.org/config-chain
npm http 304 https://registry.npmjs.org/mkdirp
npm http 304 https://registry.npmjs.org/editorconfig
npm http 304 https://registry.npmjs.org/config-chain
npm http GET https://registry.npmjs.org/proto-list
npm http 304 https://registry.npmjs.org/proto-list
npm http GET https://registry.npmjs.org/osenv
npm http GET https://registry.npmjs.org/commander
npm http 304 https://registry.npmjs.org/osenv
npm http 304 https://registry.npmjs.org/commander
npm http GET https://registry.npmjs.org/types/node
npm http GET https://registry.npmjs.org/types/semver
npm http GET https://registry.npmjs.org/os-tmpdir
npm http GET https://registry.npmjs.org/os-homedir
npm http 304 https://registry.npmjs.org/os-tmpdir
npm http 304 https://registry.npmjs.org/os-homedir
npm http 405 https://registry.npmjs.org/types/node
npm http 405 https://registry.npmjs.org/types/semver
npm ERR! Error: ENOENT, utime '/home/bamboo/bamboo-agent-home/xml-data/build-dir/GEOD-GLTG-JOB1/theme/node_modules/grunt-jsbeautifier/node_modules/lodash/next.js'
npm ERR! If you need help, you may report this *entire* log,
npm ERR! including the npm and node versions, at:
npm ERR!     <http://github.com/npm/npm/issues>

npm ERR! System Linux 4.4.0-138-generic
npm ERR! command "/home/bamboo/node-v0.10.28/bin/node" "/home/bamboo/node-v0.10.28/bin/npm" "install"
npm ERR! cwd /home/bamboo/bamboo-agent-home/xml-data/build-dir/GEOD-GLTG-JOB1/theme
npm ERR! node -v v0.10.28
npm ERR! npm -v 1.4.9
npm ERR! path /home/bamboo/bamboo-agent-home/xml-data/build-dir/GEOD-GLTG-JOB1/theme/node_modules/grunt-jsbeautifier/node_modules/lodash/next.js
npm ERR! fstream_path /home/bamboo/bamboo-agent-home/xml-data/build-dir/GEOD-GLTG-JOB1/theme/node_modules/grunt-jsbeautifier/node_modules/lodash/next.js
npm ERR! fstream_type File
npm ERR! fstream_class FileWriter
npm ERR! fstream_finish_call utimes
npm ERR! code ENOENT
npm ERR! errno 34
npm ERR! fstream_stack /home/bamboo/node-v0.10.28/lib/node_modules/npm/node_modules/fstream/lib/writer.js:305:19
npm ERR! fstream_stack Object.oncomplete (fs.js:107:15)
npm ERR! Error: Method Not Allowed
npm ERR!     at errorResponse (/home/bamboo/node-v0.10.28/lib/node_modules/npm/lib/cache.js:753:14)
npm ERR!     at /home/bamboo/node-v0.10.28/lib/node_modules/npm/lib/cache.js:773:12
npm ERR!     at saved (/home/bamboo/node-v0.10.28/lib/node_modules/npm/node_modules/npm-registry-client/lib/get.js:148:7)
npm ERR!     at /home/bamboo/node-v0.10.28/lib/node_modules/npm/node_modules/graceful-fs/polyfills.js:133:7
npm ERR!     at Object.oncomplete (fs.js:107:15)
npm ERR! If you need help, you may report this *entire* log,
npm ERR! including the npm and node versions, at:
npm ERR!     <http://github.com/npm/npm/issues>

npm ERR! System Linux 4.4.0-138-generic
npm ERR! command "/home/bamboo/node-v0.10.28/bin/node" "/home/bamboo/node-v0.10.28/bin/npm" "install"
npm ERR! cwd /home/bamboo/bamboo-agent-home/xml-data/build-dir/GEOD-GLTG-JOB1/theme
npm ERR! node -v v0.10.28
npm ERR! npm -v 1.4.9
npm ERR! code E405
npm ERR!
npm ERR! Additional logging details can be found in:
npm ERR!     /home/bamboo/bamboo-agent-home/xml-data/build-dir/GEOD-GLTG-JOB1/theme/npm-debug.log
npm ERR! not ok code 0