Illinois Nutrient Loss Reduction Strategy

Build: #18 failed Manual run by Marcus Slavenas

Build result summary

Details

Completed
Duration
29 seconds
Labels
None
Agent
buildserver-3.os.ncsa.edu
Revisions
theme
a068dc6cb568267c1531c8c854303ee0a10cf3d0 a068dc6cb568267c1531c8c854303ee0a10cf3d0
GeoDashboard
f62a11fe099b7e9a74794b85b20c6493cc522f53 f62a11fe099b7e9a74794b85b20c6493cc522f53
Failing since
#17 (Changes by Marcus Slavenas)
Fixed in
#20 (Changes by Luigi Marini)
No failed test found. A possible compilation error occurred.

Responsible

Error summary for Default Job

The job generated some errors, drill down into the full build log for more details.

npm http GET https://registry.npmjs.org/process-nextick-args
npm http GET https://registry.npmjs.org/util-deprecate
npm http GET https://registry.npmjs.org/core-util-is
npm http GET https://registry.npmjs.org/inherits
npm http GET https://registry.npmjs.org/isarray
npm http 304 https://registry.npmjs.org/ansi-regex
npm http 304 https://registry.npmjs.org/process-nextick-args
npm http 304 https://registry.npmjs.org/string_decoder
npm http 304 https://registry.npmjs.org/core-util-is
npm http 304 https://registry.npmjs.org/util-deprecate
npm http 304 https://registry.npmjs.org/inherits
npm http 304 https://registry.npmjs.org/core-util-is
npm http 304 https://registry.npmjs.org/isarray
npm http GET https://registry.npmjs.org/balanced-match
npm http GET https://registry.npmjs.org/concat-map
npm http GET https://registry.npmjs.org/ms
npm http GET https://registry.npmjs.org/lodash
npm http 304 https://registry.npmjs.org/balanced-match
npm http 304 https://registry.npmjs.org/concat-map
npm http 304 https://registry.npmjs.org/ms
npm http 304 https://registry.npmjs.org/lodash
npm WARN deprecated graceful-fs@2.0.3: please upgrade to graceful-fs 4 for compatibility with current and future versions of Node.js
npm http GET https://registry.npmjs.org/dashdash
npm http GET https://registry.npmjs.org/getpass
npm http GET https://registry.npmjs.org/jsbn
npm http GET https://registry.npmjs.org/tweetnacl
npm http GET https://registry.npmjs.org/ecc-jsbn
npm http GET https://registry.npmjs.org/bcrypt-pbkdf
npm http GET https://registry.npmjs.org/asn1
npm http GET https://registry.npmjs.org/cryptiles
npm http GET https://registry.npmjs.org/hoek
npm http GET https://registry.npmjs.org/boom
npm http GET https://registry.npmjs.org/sntp
npm http 304 https://registry.npmjs.org/dashdash
npm http 304 https://registry.npmjs.org/getpass
npm http 304 https://registry.npmjs.org/ecc-jsbn
npm http 304 https://registry.npmjs.org/jsbn
npm http 304 https://registry.npmjs.org/bcrypt-pbkdf
npm http 304 https://registry.npmjs.org/tweetnacl
npm http 304 https://registry.npmjs.org/asn1
npm http 304 https://registry.npmjs.org/cryptiles
npm http 304 https://registry.npmjs.org/hoek
npm http 304 https://registry.npmjs.org/boom
npm http 304 https://registry.npmjs.org/sntp
npm http GET https://registry.npmjs.org/xtend
npm http GET https://registry.npmjs.org/is-my-ip-valid
npm http GET https://registry.npmjs.org/jsonpointer
npm http GET https://registry.npmjs.org/generate-function
npm http GET https://registry.npmjs.org/generate-object-property
npm http GET https://registry.npmjs.org/lru-cache
npm http GET https://registry.npmjs.org/sigmund
npm WARN engine cryptiles@2.0.5: wanted: {"node":">=0.10.40"} (current: {"node":"v0.10.28","npm":"1.4.9"})
npm WARN engine hoek@2.16.3: wanted: {"node":">=0.10.40"} (current: {"node":"v0.10.28","npm":"1.4.9"})
npm WARN engine boom@2.10.1: wanted: {"node":">=0.10.40"} (current: {"node":"v0.10.28","npm":"1.4.9"})
npm http 304 https://registry.npmjs.org/xtend
npm http 304 https://registry.npmjs.org/is-my-ip-valid
npm http 304 https://registry.npmjs.org/jsonpointer
npm http 304 https://registry.npmjs.org/generate-function
npm http 304 https://registry.npmjs.org/generate-object-property
npm http 304 https://registry.npmjs.org/lru-cache
npm http 304 https://registry.npmjs.org/sigmund
npm http GET https://registry.npmjs.org/mkdirp
npm http 304 https://registry.npmjs.org/mkdirp

/home/bamboo/bamboo-agent-home/xml-data/build-dir/GEOD-ILNLRS-JOB1/geodashboard/node_modules/grunt-casperjs/node_modules/adm-zip/adm-zip.js:302
                                        attr = (0o40755 << 16) | 0x10; // (permissions drwxr-xr-x) + (MS-DOS dire
                                                ^
SyntaxError: Unexpected token ILLEGAL
    at Module._compile (module.js:439:25)
    at Object.Module._extensions..js (module.js:474:10)
    at Module.load (module.js:356:32)
    at Function.Module._load (module.js:312:12)
    at Module.require (module.js:364:17)
    at require (module.js:380:17)
    at Object.<anonymous> (/home/bamboo/bamboo-agent-home/xml-data/build-dir/GEOD-ILNLRS-JOB1/geodashboard/node_modules/grunt-casperjs/install.js:10:14)
    at Module._compile (module.js:456:26)
    at Object.Module._extensions..js (module.js:474:10)
    at Module.load (module.js:356:32)
npm ERR! grunt-casperjs@1.5.0 install: `node install.js`
npm ERR! Exit status 8
npm ERR!
npm ERR! Failed at the grunt-casperjs@1.5.0 install script.
npm ERR! This is most likely a problem with the grunt-casperjs package,
npm ERR! not with npm itself.
npm ERR! Tell the author that this fails on your system:
npm ERR!     node install.js
npm ERR! You can get their info via:
npm ERR!     npm owner ls grunt-casperjs
npm ERR! There is likely additional logging output above.

npm ERR! System Linux 4.4.0-124-generic
npm ERR! command "/home/bamboo/node-v0.10.28/bin/node" "/home/bamboo/node-v0.10.28/bin/npm" "install"
npm ERR! cwd /home/bamboo/bamboo-agent-home/xml-data/build-dir/GEOD-ILNLRS-JOB1/geodashboard
npm ERR! node -v v0.10.28
npm ERR! npm -v 1.4.9
npm ERR! code ELIFECYCLE
npm ERR!
npm ERR! Additional logging details can be found in:
npm ERR!     /home/bamboo/bamboo-agent-home/xml-data/build-dir/GEOD-ILNLRS-JOB1/geodashboard/npm-debug.log
npm ERR! not ok code 0